program: Gaussian 09
title: 000102425
version: EM64L-G09RevD.01
frameworkgroup: C1[X(C10H18O)]
method: RPBEPBE
basis: SDD
operation: Freq
keyword: #pfreq=noraman
keyword: PBEPBE/SDD
title: #p freq=noraman PBEPBE/SDD
converged: YES YES NO YES
title: Mulliken charges:
elementType: O C C C C C C C C C C H H H H H H H H H H H H H H H H H H
charge: -0.458995 -0.042708 -0.037822 -0.127652 -0.463906 -0.467511 -0.458772 -0.443727 -0.408132 -0.403173 -0.399612 0.216553 0.200495 0.185607 0.196690 0.197247 0.243552 0.181582 0.193209 0.194953 0.182036 0.213486 0.197406 0.201030 0.192844 0.197741 0.189831 0.196555 0.331193
chargesum: 0.00000
title: Mulliken charges with hydrogens summed into heavy atoms:
elementType: O C C C C C C C C C C
charge: -0.127802 0.173845 0.162672 0.057955 -0.069969 -0.042377 -0.070610 -0.048204 -0.009696 -0.012588 -0.013226
polarizability: 1.19503041e+02 4.03315507e-02 1.08020068e+02 7.69690125e-01 -1.95524902e-02 8.65097486e+01
1716.lowfreq: -19.4756 -9.7183 -0.0005 0.0003 0.0004 33.2628 94.2230 123.5565 166.7261
frequency: 94.0395 123.5514 166.7154 227.7190 258.7085 276.1316 293.5890 330.0986 368.8324 383.8116 404.3535 427.6397 467.8421 488.9679 521.9673 536.4723 776.0645 820.1767 831.2278 836.4509 845.4720 869.1104 897.9045 910.0817 945.3739 988.4940 994.7344 1003.4540 1038.0789 1052.7866 1057.5892 1086.5602 1099.1327 1113.1066 1131.2121 1136.3012 1152.7061 1165.3895 1215.4040 1218.3076 1233.1213 1249.6559 1267.5451 1278.8938 1288.7235 1297.6768 1300.6055 1326.9222 1328.8180 1331.8107 1338.4098 1339.2225 1345.3398 1346.7306 1351.5928 1389.8071 1456.6967 1461.6164 1462.7779 1465.0917 1467.1997 1469.8200 1473.6712 2907.7760 2919.3290 2945.2308 2952.6209 2957.9969 2960.9365 2962.2127 2962.7750 2966.5287 2969.6479 3012.6396 3021.3666 3023.8207 3024.1126 3034.1206 3039.9955 3056.9939 3556.2870
redmass: 3.1402 2.4768 2.4307 4.0701 1.8833 1.1844 1.6540 1.7539 3.6647 3.7149 3.2416 3.5531 2.5334 2.8542 2.0765 1.6755 1.9360 1.9123 1.6999 1.8599 1.9792 1.7343 2.4592 1.5262 2.9426 1.9249 1.5870 2.4984 2.1710 1.4966 1.2401 1.6675 1.6894 2.4084 1.9315 1.7878 2.2586 1.4189 1.3693 1.4065 1.3346 1.2234 1.3333 1.2786 1.2913 1.2124 1.2124 1.3941 1.4115 1.3997 1.5050 1.4720 1.6204 1.5122 1.5131 1.6704 1.0891 1.0874 1.0911 1.0897 1.0856 1.0907 1.0946 1.0823 1.0802 1.0762 1.0609 1.0657 1.0616 1.0652 1.0649 1.0646 1.0653 1.0991 1.1005 1.0968 1.0971 1.1022 1.1017 1.0950 1.0660
irintensity: 0.7209 1.1614 0.5454 6.2281 1.3185 101.7090 30.4491 2.6943 4.0660 0.1124 4.7212 0.9309 4.6836 3.3323 4.3994 0.4375 2.6392 5.2252 12.0272 8.0878 4.3753 5.5222 1.6091 8.1886 28.3074 9.5240 22.6517 15.1407 23.2660 3.4308 1.2704 8.2651 0.9350 2.0378 9.3733 2.2888 1.8223 7.4131 1.8430 11.8454 5.6825 1.9066 2.1775 0.3844 10.4719 4.4956 1.7780 0.6971 4.1078 0.8491 2.1265 0.7680 0.4110 5.6000 0.8722 4.9341 2.3829 11.8917 1.9177 8.1297 17.2258 16.1133 1.5516 29.1049 11.9537 7.2679 5.4448 6.9380 49.6333 70.5059 50.1572 93.1459 34.0871 18.0676 68.6711 110.2301 25.3402 67.6474 113.6324 38.0846 2.5278
temp: 298.150 k
press: 1.00000 atm
elementType: 8 6 6 6 6 6 6 6 6 6 6 1 1 1 1 1 1 1 1 1 1 1 1 1 1 1 1 1 1
symmnumber: 1
zpe: 688461.0 jmol-1
zpe.correction: 0.262221 hartree
zpe.thermalcorrener: 0.272684 hartree
zpe.thermalcorrenthalpy: 0.273629 hartree
zpe.thermalcorrgfe: 0.227198 hartree
zpe.sumelectzpe: -466.198189 hartree
zpe.sumelectthermal: -466.187725 hartree
zpe.sumelectthermalent: -466.186781 hartree
zpe.sumelectthermalfe: -466.233212 hartree
dipole: 1.1221 -1.1571 0.8442
dipole: 1.8195
quadrupole: -63.9326 -72.3338 -68.5993
quadrupole: 1.7300 1.6070 1.8824
quadrupole: 4.3560 -4.0452 -0.3108 1.7300 1.6070 1.8824
hfenergy: -466.4604098 hartree
pointgroup: C01 [X(C10H18O1)]
dipole: -0.4438196 -0.4535285 -0.3312937 debye
polarizability: 119.4970539|-0.1208222|108.0209383|0.8666012|-0.0871917|86.5148648 unknown
InChI: InChI=1S/C10H18O/c11-10-7-3-5-8-4-1-2-6-9(8)10/h8-11H,1-7H2
charge 0 multiplicity 1
29 atoms
O  -1.62196 2.295091 0.224924
C  0.009705 0.504987 0.189672
C  0.32118 -0.95858 -0.244103
C  -1.386928 0.93052 -0.300284
C  -0.787184 -1.931744 0.223901
C  1.115935 1.47248 -0.297116
C  1.71899 -1.386285 0.267169
C  -2.488299 -0.041429 0.170851
C  -2.18255 -1.492108 -0.27426
C  2.510299 1.038552 0.20936
C  2.830258 -0.418683 -0.202253
H  -0.016078 0.53605 1.301811
H  0.347181 -0.979416 -1.358182
H  -1.383755 0.958769 -1.415976
H  -0.788781 -1.971114 1.333815
H  -0.559629 -2.956158 -0.132484
H  0.876477 2.497409 0.037003
H  1.117788 1.48653 -1.408662
H  1.938396 -2.41844 -0.073126
H  1.701064 -1.413324 1.377595
H  -3.474164 0.282681 -0.223374
H  -2.54439 0.009223 1.276866
H  -2.213655 -1.554493 -1.381975
H  -2.965478 -2.175859 0.105868
H  2.537188 1.118353 1.316183
H  3.287677 1.725275 -0.178815
H  2.917027 -0.472783 -1.307647
H  3.808936 -0.731331 0.211614
H  -2.53615 2.579227 -0.030474
