program: Gaussian 09
title: 000102382
version: EM64L-G09RevD.01
frameworkgroup: C1[X(C21H23N3O2)]
method: RPBEPBE
basis: SDD
operation: Freq
keyword: #p
keyword: freq=noraman
keyword: PBEPBE/SDD
title: #p freq=noraman PBEPBE/SDD
converged: YES YES NO NO
title: Mulliken charges:
elementType: O O N N N C C C C C C C C C C C C C C C C C C C C C H H H H H H H H H H H H H H H H H H H H H H H
charge: -0.258571 -0.258523 -0.053459 -0.209801 -0.715984 0.219154 -0.276842 -0.219392 -0.135437 -0.282522 -0.508166 -0.537397 0.298417 -0.401548 -0.064979 0.500822 -0.648737 0.198899 -0.562053 0.089371 -0.684708 -0.487619 -0.364607 -0.321788 0.551109 -0.452038 0.252342 0.232516 0.283685 0.259989 0.216422 0.233170 0.249596 0.231285 0.228627 0.190020 0.218342 0.235875 0.232115 0.245903 0.260676 0.230803 0.219746 0.235394 0.206096 0.295961 0.218625 0.303360 0.305853
chargesum: 0.00000
title: Mulliken charges with hydrogens summed into heavy atoms:
elementType: O O N N N C C C C C C C C C C C C C C C C C C C C C
charge: -0.258571 -0.258523 -0.053459 -0.209801 -0.106771 0.219154 -0.024500 0.013124 0.148248 -0.022533 -0.058574 -0.056516 0.298417 0.017099 0.153363 0.500822 -0.180747 0.198899 -0.055474 0.089371 -0.453906 -0.267873 0.076883 -0.025827 0.551109 -0.233414
polarizability: 3.23421570e+02 -1.54512285e+01 2.52797460e+02 -1.84909970e+01 5.85815936e+00 1.61447886e+02
1716.lowfreq: -0.0007 -0.0007 0.0004 6.6817 7.8766 11.0367 47.2806 79.6714 89.3556
frequency: 47.2487 79.6660 89.3313 101.7941 128.8409 141.2591 183.8465 201.1196 209.5784 233.0224 260.3244 275.8034 285.2656 298.9621 322.8873 330.5041 339.0803 349.9534 350.5927 362.1170 379.6385 396.5093 403.5814 429.5933 441.7294 464.0323 469.6765 475.0546 492.4411 526.4328 539.4212 560.7019 586.4550 612.3549 617.2229 624.1601 647.2973 664.6799 673.6016 712.1477 733.1119 742.9110 765.8580 772.1286 810.2103 824.6527 834.5028 840.0420 850.6070 858.1945 868.2944 886.5860 917.7343 924.2987 939.7421 953.9547 963.2736 969.8190 982.8662 987.9404 998.1701 1018.0222 1026.1208 1033.7516 1043.3670 1057.5849 1069.6454 1077.5061 1089.5492 1100.3002 1110.5747 1116.1133 1123.7195 1135.7044 1155.4195 1162.4018 1171.9203 1176.4476 1185.6348 1203.8776 1213.3622 1221.5248 1231.2735 1240.4145 1254.0229 1259.4717 1268.3328 1273.8499 1280.4142 1288.4816 1294.8209 1303.6591 1307.2316 1318.0343 1323.2378 1331.1997 1339.0592 1343.3910 1347.3663 1354.4322 1356.6050 1380.7488 1392.3921 1400.3133 1425.7323 1446.0961 1453.4098 1456.2404 1466.8034 1471.8238 1482.7880 1486.7648 1507.6653 1569.8977 1592.8717 1634.0642 1643.4167 1665.8609 2897.9222 2941.3844 2946.0892 2952.3438 2964.3924 2971.4329 2987.8017 2995.7337 3000.4354 3008.2720 3010.1438 3016.4956 3018.3346 3048.1485 3052.7308 3066.7373 3077.8396 3081.4297 3114.4224 3126.9728 3189.3399 3570.4784 3711.2864
redmass: 4.8849 3.9998 3.4841 5.1512 4.1126 3.6293 2.7468 4.0173 3.8248 3.6334 3.3348 5.3207 4.0970 3.4665 1.2135 3.9036 3.7267 1.1148 4.0344 3.5217 2.8391 3.8860 3.0851 3.3959 3.4868 3.8330 4.9029 4.6590 5.1978 2.9645 4.4028 3.9651 4.3752 4.3323 3.3965 4.6911 3.8328 4.9069 4.0836 5.3275 3.0657 3.6792 3.4189 3.5613 1.6285 1.4413 2.0133 2.8857 3.8436 1.7176 2.5596 3.2073 3.5300 3.0707 2.1706 1.3338 2.6176 2.3888 2.3452 2.5179 2.3015 2.7577 2.0994 1.8884 4.1414 2.6473 2.2384 2.6764 2.6125 1.8797 3.0673 1.9008 2.9058 1.9444 1.5775 1.4704 1.7528 2.0181 1.6760 2.1001 1.4008 1.5927 1.3212 1.6226 1.6279 1.4555 1.5534 1.3978 1.3894 1.7317 1.6135 1.4978 1.3286 1.6002 1.5563 1.6191 1.5739 1.6692 1.6089 1.7324 1.5409 1.5646 4.0993 1.5388 1.1302 1.1057 1.0877 1.0840 2.3568 1.4143 1.0841 3.7206 1.0885 9.7971 8.2294 2.4258 1.6808 7.6348 1.0712 1.0659 1.0847 1.0832 1.0670 1.0830 1.0856 1.0680 1.0806 1.0603 1.0792 1.0707 1.0955 1.0978 1.1001 1.1009 1.1044 1.0894 1.0912 1.0904 1.0946 1.0447 1.1040
irintensity: 2.1536 1.2943 1.6296 1.3648 2.3710 0.5619 9.8762 0.2145 2.4697 1.2939 4.1512 5.1085 2.6422 3.1916 235.1556 7.0868 2.9243 61.9591 5.0404 9.7157 0.5201 1.5427 0.8805 3.1316 0.3635 4.0909 16.2289 5.1467 9.5904 1.2478 6.3241 5.9255 1.5255 5.3021 1.4277 4.5093 3.1688 5.8507 5.7489 1.5255 2.0413 3.1172 11.7453 3.6955 4.9899 37.1863 15.1177 17.6224 2.7138 18.4510 24.9546 0.8415 4.1153 4.4248 2.9277 1.5881 7.0176 3.6726 1.5774 2.9143 12.2702 32.1080 14.3088 8.6582 23.6358 11.3801 5.5681 6.5892 38.6525 3.5316 66.9480 14.9577 2.3468 9.1265 4.8037 5.6622 1.6890 0.4855 26.1816 6.5271 2.8640 5.0705 7.1477 10.1735 23.6981 90.8466 11.9201 23.8817 2.3333 8.0295 55.1293 48.4535 1.9373 47.9338 8.4587 1.2280 2.2805 2.8469 10.1323 24.4934 4.8845 36.9088 22.7994 7.0177 1.8732 4.1948 7.6407 13.7457 3.8895 5.6537 14.8892 261.9988 0.9803 368.0524 13.8707 3.9769 298.2563 6.6727 54.8340 102.6324 45.9181 16.0108 44.6495 3.9499 45.9309 18.2588 30.5652 15.7171 58.5793 52.3306 17.8213 37.1717 14.0805 11.4442 19.3381 29.5388 16.6114 27.9385 1.3904 86.8385 19.1533
temp: 298.150 k
press: 1.00000 atm
elementType: 8 8 7 7 7 6 6 6 6 6 6 6 6 6 6 6 6 6 6 6 6 6 6 6 6 6 1 1 1 1 1 1 1 1 1 1 1 1 1 1 1 1 1 1 1 1 1 1 1
symmnumber: 1
zpe: 1065679.7 jmol-1
zpe.correction: 0.405896 hartree
zpe.thermalcorrener: 0.425642 hartree
zpe.thermalcorrenthalpy: 0.426586 hartree
zpe.thermalcorrgfe: 0.360416 hartree
zpe.sumelectzpe: -1126.827650 hartree
zpe.sumelectthermal: -1126.807904 hartree
zpe.sumelectthermalent: -1126.806959 hartree
zpe.sumelectthermalfe: -1126.873130 hartree
dipole: 0.0328 -5.4152 -0.1938
dipole: 5.4188
quadrupole: -124.1340 -169.2436 -150.5117
quadrupole: -9.0232 -10.9597 1.4488
quadrupole: 23.8291 -21.2805 -2.5486 -9.0232 -10.9597 1.4488
hfenergy: -1127.2335455 hartree
pointgroup: C01 [X(C21H23N3O2)]
dipole: -0.0431247 2.131068 0.0424259 debye
polarizability: 321.972858|17.470108|253.8227473|20.5516327|5.1701167|161.8713096 unknown
InChI: InChI=1S/C21H23N3O2/c22-12-1-2-15-14(7-12)21-4-5-23-10-11-3-6-26-16-9-18(25)24(15)20(21)19(16)13(11)8-17(21)23/h1-3,7,13,16-17,19-20H,4-6,8-10,22H2
charge 0 multiplicity 1
49 atoms
O  -3.311072 -2.006729 0.721652
O  1.142928 -3.695757 -0.437702
N  -1.249406 2.704078 -0.484474
N  0.736076 -1.400959 -0.590554
N  5.429306 1.336226 0.946341
C  0.537399 1.038348 -0.441397
C  -0.265547 -0.291096 -0.539599
C  -0.214067 2.102468 0.440594
C  -1.218244 -0.669884 0.613249
C  -1.957086 0.496561 1.288394
C  -0.890931 1.536885 1.702438
C  0.516867 1.77212 -1.822445
C  1.92845 0.546661 -0.06093
C  -0.913382 2.353872 -1.89525
C  -2.092587 -1.746979 -0.057065
C  -3.003258 1.089715 0.349908
C  -2.682423 2.518715 -0.096978
C  2.022446 -0.861783 -0.251619
C  -1.207011 -3.001748 -0.246504
C  0.319185 -2.729717 -0.453761
C  3.053672 1.287044 0.330665
C  -4.066647 0.349954 -0.073966
C  -4.417802 -1.090622 0.317326
C  3.243074 -1.539918 -0.062303
C  4.296948 0.617458 0.546063
C  4.370789 -0.791927 0.340041
H  -0.840023 -0.283048 -1.485554
H  0.521155 2.881858 0.730101
H  -0.611872 -1.148406 1.409541
H  -2.457678 0.089718 2.187252
H  -1.340811 2.362165 2.285095
H  -0.127923 1.063101 2.348832
H  0.750111 1.092811 -2.660526
H  1.271872 2.57949 -1.816541
H  -0.966747 3.239991 -2.555946
H  -1.620854 1.594175 -2.303762
H  -2.412376 -1.374277 -1.052643
H  -3.308282 2.824699 -0.954674
H  -2.916178 3.220664 0.729135
H  -1.561522 -3.642708 -1.073676
H  -1.25852 -3.61931 0.670474
H  2.986842 2.373492 0.470194
H  -4.783391 0.800587 -0.777992
H  -5.104937 -1.108765 1.185596
H  -4.950585 -1.555771 -0.540644
H  3.299108 -2.619761 -0.214196
H  5.326601 -1.306784 0.49703
H  5.386514 2.339745 1.093306
H  6.315018 0.864446 1.099777
