program: Gaussian 09
title: 000102379
version: EM64L-G09RevD.01
frameworkgroup: C1[X(C15H16NO3S2)]
method: RPBEPBE
basis: SDD
operation: Freq
keyword: #p
keyword: freq=noraman
keyword: PBEPBE/SDD
title: #p freq=noraman PBEPBE/SDD
converged: YES YES NO NO
title: Mulliken charges:
elementType: S S O O O N C C C C C C C C C C C C C C C H H H H H H H H H H H H H H H H
charge: 0.429834 1.054269 -0.560318 -0.481591 -0.501207 -0.152754 -0.456412 0.572602 -0.345261 -0.497964 0.281291 -0.028379 -0.616999 0.445542 -0.300842 -0.440451 -0.714643 -0.289527 -0.414976 -0.272886 -0.220954 0.266318 0.285033 0.283314 0.267627 0.306057 0.301805 0.274396 0.274500 0.278798 0.281185 0.277619 0.224203 0.267133 0.256162 0.264544 0.402932
chargesum: 1.00000
title: Mulliken charges with hydrogens summed into heavy atoms:
elementType: S S O O O N C C C C C C C C C C C C C C C
charge: 0.429834 1.054269 -0.157386 -0.481591 -0.501207 -0.152754 0.094939 0.572602 0.205679 -0.497964 0.281291 -0.028379 -0.009137 0.445542 -0.026446 -0.165950 0.122960 -0.065324 -0.147844 -0.016724 0.043589
polarizability: 2.52878666e+02 -1.29818660e+01 2.94594522e+02 3.49187053e+01 6.54247748e+00 1.31985494e+02
1716.lowfreq: -12.8842 -6.6088 -0.0016 0.0015 0.0018 3.2309 7.2392 17.4841 24.7196
frequency: -11.2583 17.2822 24.5645 45.6811 72.0203 79.3112 129.1654 145.8245 154.4085 166.0915 192.3244 202.4195 215.6375 228.7913 256.6826 272.4771 289.7813 307.8243 315.2363 331.0250 356.5819 360.3631 373.7083 409.5067 417.6194 460.8512 495.8395 506.7588 515.9992 527.9488 558.3031 568.2841 603.3836 627.0338 640.2344 667.7974 694.4330 725.4021 756.3393 771.7437 794.7625 823.3285 825.0968 842.9296 853.3201 873.9006 884.3817 943.0082 954.2209 964.9725 989.6220 1012.8830 1015.9587 1024.0213 1034.0325 1045.1139 1051.5816 1070.2283 1078.6572 1088.9907 1152.4528 1167.7223 1170.6757 1192.1280 1198.7333 1240.4864 1247.0912 1258.8025 1270.5234 1299.4053 1305.8435 1331.7965 1354.6739 1379.6952 1396.0888 1408.3111 1414.0632 1423.3479 1432.1591 1437.6958 1456.1823 1463.6918 1471.7515 1492.3150 1514.3103 1526.6270 1571.2530 1588.2804 1625.3791 2986.5266 3004.6168 3056.7749 3059.2779 3066.5293 3069.3929 3112.7233 3116.0437 3147.3666 3149.3442 3156.1283 3157.9734 3180.1680 3181.0121 3218.6868 3491.8157
redmass: 6.9779 9.6808 5.5797 4.9274 6.0739 3.2671 6.9148 4.1573 2.4041 1.1778 3.0066 3.3202 4.0919 4.0182 2.8547 2.7858 4.9753 2.8416 4.5501 7.5928 3.3284 4.4502 7.1425 4.4725 3.4150 4.9764 4.8461 3.7658 5.4923 4.6644 6.9112 9.0132 4.5483 7.6466 5.7132 4.8618 5.0539 3.6522 1.2815 1.1386 3.3344 1.8977 1.9176 9.2370 1.7035 5.0843 1.6427 3.1742 4.2307 1.3446 1.4210 1.4101 1.9467 1.8598 2.9014 1.7743 2.2537 2.0281 1.6744 2.9990 1.7736 1.2944 2.1024 1.7864 1.3436 1.8630 1.2427 2.1864 1.4139 1.9633 1.0998 1.3121 2.0978 1.4803 5.6026 1.1720 4.4218 1.1191 2.3686 2.2985 1.3613 1.0811 1.9146 1.1231 1.8128 1.7649 7.1667 6.1316 6.3751 1.0406 1.0611 1.0633 1.0620 1.0945 1.0960 1.1003 1.1019 1.0892 1.1111 1.0899 1.0912 1.0989 1.0985 1.0909 1.0667
irintensity: 1.7772 0.8845 0.5892 0.6321 2.9021 1.6132 0.7856 1.4394 0.1882 0.8174 4.8048 11.3126 1.3243 11.7067 27.5831 20.8793 15.2736 88.3195 4.0367 10.2203 1.6341 0.3657 46.2625 2.0952 1.2716 0.6903 2.6240 1.0154 11.1952 7.3654 52.4851 96.3622 9.3032 0.5449 6.5870 10.1055 12.3521 3.8958 31.1051 5.5574 17.0262 18.6051 25.0060 47.0385 9.1704 2.5996 20.2069 3.9582 55.2333 0.4454 2.4189 1.4739 3.1610 21.6148 14.4220 31.3822 2.9010 20.3187 12.5112 9.2597 14.9932 8.3818 2.3962 16.5769 4.3704 6.5986 0.8849 29.4098 5.2196 21.9722 0.8649 4.2140 35.7887 3.8169 18.8084 20.8752 8.4959 7.3509 2.2856 6.6276 37.5727 20.7903 6.0563 21.5596 39.1316 27.6979 8.4665 24.2144 2.8989 0.7320 7.3030 3.8201 2.6959 4.9577 0.8362 0.8610 1.8085 0.6700 0.0025 0.4911 2.8916 4.7720 2.5216 12.7525 99.4680
temp: 298.150 k
press: 1.00000 atm
elementType: 16 16 8 8 8 7 6 6 6 6 6 6 6 6 6 6 6 6 6 6 6 1 1 1 1 1 1 1 1 1 1 1 1 1 1 1 1
symmnumber: 1
zpe: 739301.5 jmol-1
zpe.correction: 0.281585 hartree
zpe.thermalcorrener: 0.301224 hartree
zpe.thermalcorrenthalpy: 0.302168 hartree
zpe.thermalcorrgfe: 0.232140 hartree
zpe.sumelectzpe: -1655.817810 hartree
zpe.sumelectthermal: -1655.798171 hartree
zpe.sumelectthermalent: -1655.797227 hartree
zpe.sumelectthermalfe: -1655.867254 hartree
dipole: -5.9893 -3.4770 4.2531
dipole: 8.1272
quadrupole: -89.7472 -96.1271 -138.3477
quadrupole: -4.1128 18.3526 -1.0542
quadrupole: 18.3268 11.9469 -30.2737 -4.1128 18.3526 -1.0542
hfenergy: -1656.0993947 hartree
pointgroup: C01 [X(C15H16N1O3S2)]
dipole: -2.2099125 -1.6324525 1.6356107 debye
polarizability: 255.585473|-17.6327649|291.0845151|34.7072599|12.1868306|132.7886935 unknown
InChI: InChI=1S/C15H16NO3S2/c1-11-16(9-4-10-21(17,18)19)15-13-6-3-2-5-12(13)7-8-14(15)20-11/h2-3,5-8,17H,4,9-10H2,1H3
charge 1 multiplicity 1
37 atoms
S  -1.766764 -3.299311 -0.465776
S  4.455761 0.762824 -0.514384
O  5.833907 0.818471 0.712357
O  4.173745 2.225019 -1.138724
O  4.586651 -0.528098 -1.481317
N  -0.249196 -1.437484 0.552015
C  0.951525 -0.831693 1.208933
C  -1.412439 -0.710213 0.124583
C  1.93378 -0.25482 0.159932
C  -2.362455 -1.595695 -0.442057
C  -1.709209 0.709127 0.212176
C  -0.269395 -2.776152 0.308061
C  3.158037 0.354022 0.851803
C  -3.024876 1.111557 -0.271754
C  -3.632082 -1.191713 -0.924364
C  -3.947887 0.157452 -0.821454
C  0.813002 -3.749292 0.651675
C  -0.845535 1.744577 0.701882
C  -3.412966 2.488314 -0.215901
C  -1.256653 3.08178 0.737985
C  -2.550656 3.46425 0.283906
H  1.446347 -1.622597 1.794623
H  0.599715 -0.078871 1.929767
H  1.431441 0.501516 -0.469106
H  2.266879 -1.06719 -0.514192
H  3.700449 -0.344227 1.508143
H  2.991597 1.321518 1.349702
H  -4.331908 -1.913279 -1.352965
H  -4.920791 0.515876 -1.172868
H  0.913493 -3.877439 1.746712
H  0.585454 -4.74015 0.228556
H  1.793783 -3.436379 0.250527
H  0.16426 1.533258 1.049433
H  -4.407219 2.764759 -0.58272
H  -0.567634 3.844578 1.113924
H  -2.856967 4.513528 0.319124
H  6.670707 1.130778 0.260962
