program: Gaussian 09
title: 000102355
version: EM64L-G09RevD.01
frameworkgroup: C1[X(C9H13OPS2)]
method: RPBEPBE
basis: SDD
operation: Freq
keyword: #p
keyword: freq=noraman
keyword: PBEPBE/SDD
title: #p freq=noraman PBEPBE/SDD
converged: YES YES NO NO
title: Mulliken charges:
elementType: S S P O C C C C C C C C C H H H H H H H H H H H H H
charge: -0.024590 -0.210853 0.477701 -0.443071 -0.623202 -0.626770 -0.150683 -0.236670 -0.202636 -0.486048 -0.206593 -0.206656 -0.225310 0.256174 0.287841 0.228014 0.247618 0.238097 0.246243 0.263784 0.236807 0.215466 0.250072 0.230823 0.232714 0.231729
chargesum: 0.00000
title: Mulliken charges with hydrogens summed into heavy atoms:
elementType: S S P O C C C C C C C C C
charge: -0.024590 -0.210853 0.477701 -0.443071 -0.079188 0.086959 -0.150683 0.009573 0.061148 0.216297 0.024230 0.026059 0.006420
polarizability: 2.16103238e+02 -1.71853897e+00 1.63045946e+02 -9.38716844e+00 1.22582838e+01 1.22469796e+02
1716.lowfreq: -12.5463 -7.3940 -0.0029 -0.0023 -0.0021 6.8724 16.1349 33.8313 56.4767
frequency: 15.7014 33.2999 56.4586 60.8196 66.6069 110.1426 125.0068 135.4708 154.6778 159.9781 188.5577 232.3166 254.8973 277.7709 297.2149 335.2520 364.2578 399.5617 408.0903 477.8529 523.9389 608.7892 620.2829 671.7427 679.1675 690.4590 751.7589 773.6930 843.2864 921.5994 955.3715 974.4901 984.7596 994.8058 997.2559 1014.3836 1032.4779 1054.9368 1067.3086 1074.9021 1101.5171 1120.9509 1172.6225 1183.6997 1241.0541 1267.1160 1300.9729 1377.3295 1396.8899 1417.0761 1419.0378 1425.6868 1455.8460 1457.4151 1468.3952 1468.8683 1483.5411 1583.7938 1585.9180 2962.9455 2990.9906 3010.5709 3058.5222 3077.0991 3088.8789 3103.7962 3115.9416 3130.0521 3140.8826 3153.5207 3164.3419 3175.0933
redmass: 5.1382 4.1463 6.2770 2.5068 2.3494 1.7047 2.1959 4.1041 5.9364 2.2688 4.8459 1.4263 6.7180 5.8428 4.2729 7.4421 4.4167 5.9321 3.5996 3.5227 7.2027 6.4969 10.1165 5.6523 6.7648 2.1733 1.5107 1.2311 1.2445 1.3695 10.5179 1.3928 6.3188 1.6949 1.3331 3.4861 1.2735 2.3286 2.2670 1.6391 1.2457 1.2991 1.0548 1.1124 1.2079 1.3072 1.3144 9.7856 1.1834 1.1140 1.0871 2.0919 1.8510 1.1193 1.0412 1.0497 1.0473 6.1270 6.0917 1.0312 1.0353 1.0577 1.1035 1.1030 1.0997 1.1023 1.1010 1.0850 1.0888 1.0936 1.0974 1.0999
irintensity: 1.5764 0.6591 3.2106 4.3877 1.6056 0.1502 1.1695 0.5795 1.1116 1.8662 6.3076 5.4503 10.6856 4.8659 4.9014 30.6962 5.8914 0.4968 1.0234 10.4159 69.7765 0.4437 70.5089 40.7357 8.2573 35.2410 58.9586 43.5957 1.0387 0.9281 133.4058 0.5276 4.5642 8.0095 0.0345 11.0152 10.0348 10.5677 0.5868 7.6159 0.2305 0.6511 0.0327 3.1756 3.8704 12.6257 1.5897 1.6897 22.2329 5.9296 4.6544 12.4410 13.1496 14.8719 21.3437 11.7525 10.6982 1.5586 1.3091 62.7541 26.7564 8.6523 30.9121 1.5431 18.9306 14.4063 11.7218 0.2696 6.5698 21.9030 23.3968 9.7355
temp: 298.150 k
press: 1.00000 atm
elementType: 16 16 15 8 6 6 6 6 6 6 6 6 6 1 1 1 1 1 1 1 1 1 1 1 1 1
symmnumber: 1
zpe: 523304.7 jmol-1
zpe.correction: 0.199316 hartree
zpe.thermalcorrener: 0.215430 hartree
zpe.thermalcorrenthalpy: 0.216374 hartree
zpe.thermalcorrgfe: 0.153000 hartree
zpe.sumelectzpe: -1562.337945 hartree
zpe.sumelectthermal: -1562.321832 hartree
zpe.sumelectthermalent: -1562.320888 hartree
zpe.sumelectthermalfe: -1562.384262 hartree
dipole: -0.9369 2.0068 2.3840
dipole: 3.2540
quadrupole: -81.6758 -91.1101 -111.6146
quadrupole: -3.2684 -8.5354 -3.2818
quadrupole: 13.1244 3.6901 -16.8144 -3.2684 -8.5354 -3.2818
hfenergy: -1562.5372616 hartree
pointgroup: C01 [X(C9H13O1P1S2)]
dipole: -0.3979662 -0.5671453 -1.0765514 debye
dipolederiv: -0.3876217 0.0311852 0.1003585 0.0831972 -0.2363351 -0.0805198 0.3686803 -0.0115136 -0.4756497 -0.4051777 0.0280957 -0.0468746 0.0427988 -0.4476294 -0.1976907 0.1005918 -0.1372091 -0.5733654 1.2340887 0.051776 -0.113274 0.1559807 1.3934383 0.3222855 -0.6819824 -0.003954 1.2652995 -0.7006202 -0.1627226 0.0255663 -0.3788843 -1.2582873 -0.0807705 0.1056078 -0.0889784 -0.5104349 -0.1077435 -0.0294075 0.0369662 -0.1168803 -0.1698413 -0.0398761 0.1944329 0.0264434 -0.1124318 -0.0984988 0.1236072 -0.0376749 -0.029478 -0.0190992 -0.0012266 -0.0547582 0.0537489 0.0082424 0.4446402 0.0051203 -0.0006643 0.0923308 0.0020509 -0.0005642 0.1689212 -0.0082985 -0.1216897 -0.1820792 0.101977 0.0538527 -0.1518926 0.0185323 0.0509045 -0.0231351 0.0567738 -0.0730061 -0.0779825 -0.1496399 -0.0171336 0.0699786 -0.0381055 -0.0250777 -0.113679 0.0086109 -0.0475324 0.3558734 0.099404 0.0251479 0.1743601 0.5106075 0.0355108 0.1600216 0.3943913 0.2172996 -0.035984 -0.1467552 0.0190488 -0.1033371 0.0309208 0.016742 0.0085666 -0.0109184 -0.1269102 -0.1327062 0.097758 0.0755648 0.064314 0.0880822 0.0572489 0.0286246 0.1123334 -0.0871821 0.0606555 0.0129943 0.1118999 -0.0093528 -0.0158933 0.0460606 0.0821134 0.0343227 -0.0940536 0.0485395 -0.0015495 -0.0469429 0.0056231 -0.0269087 -0.0659673 -0.0394236 -0.0938189 -0.0148892 -0.0867136 -0.0225436 0.0587993 0.01577 0.0520485 0.031145 0.0024476 0.0556659 0.013306 -0.118932 0.0637771 -0.1045266 0.0876716 0.0379946 0.0445862 -0.1129308 0.0473446 0.072247 0.1396775 -0.0547363 -0.0240223 -0.0123539 0.0212427 -0.0506171 0.0244142 -0.1226911 -0.0142383 0.0459978 -0.0678357 0.1314603 -0.0353072 0.0742863 -0.0057977 0.105894 0.0297582 0.0131735 0.1044295 -0.0691796 -0.0552802 -0.0471416 -0.027884 -0.0376157 -0.0237591 -0.052593 0.1143085 0.048156 0.0930244 -0.031798 0.0792073 0.0399484 -0.0038533 -0.0110771 -0.0258232 0.1011451 -0.0192205 0.0264762 0.0931127 -0.00799 0.0877292 0.0191974 0.040198 -0.1140877 -0.0140838 -0.1449564 -0.0569376 -0.1027979 0.0214517 0.0165677 -0.0044392 -0.1280337 -0.0979182 0.016199 0.1009914 -0.0128133 -0.0218141 -0.0247207 -0.1261037 0.0617449 -0.0111415 0.0589384 0.0516061 -0.0251233 0.0982687 -0.0202317 0.1189239 -0.0322925 -0.0111485 -0.0393587 -0.0101294 0.1475383 0.0435095 -0.0389862 -0.0261853 -0.0714978 -0.0671994 -0.0595456 -0.0561481 -0.07491 0.1248444 -0.1031995 -0.0203569 -0.0825572 -0.0227718 0.09213 -0.020716 -0.0950867 -0.0254879 0.1202576 unknown
polarizability: 216.6807312|2.8633553|155.483496|4.6357939|20.2798907|129.4547528 unknown
InChI: InChI=1S/C6H5S.C3H8OPS/c7-6-4-2-1-3-5-6;1-3-5(6)4-2/h1-5H;3H2,1-2H3
charge 0 multiplicity 1
26 atoms
S  -0.486895 -0.239271 -1.422475
S  -1.229329 1.108788 2.043984
P  -1.842913 -0.132143 0.518139
O  -2.024623 -1.784057 1.099917
C  -3.502207 0.280205 -0.281741
C  -3.579294 1.747972 -0.737844
C  1.178866 -0.012408 -0.683895
C  2.062953 -1.116525 -0.616947
C  1.586552 1.267221 -0.236683
C  -2.212188 -2.883835 0.132711
C  3.370064 -0.932089 -0.114193
C  2.893048 1.439266 0.275586
C  3.785943 0.344743 0.333194
H  -3.637892 -0.417389 -1.128229
H  -4.261559 0.050945 0.48777
H  -4.571249 1.946364 -1.181929
H  -3.437003 2.432936 0.115849
H  -2.809059 1.97448 -1.495937
H  1.729189 -2.102663 -0.955478
H  0.890496 2.109399 -0.285785
H  -1.430202 -2.861325 -0.649378
H  -3.214381 -2.846111 -0.336513
H  -2.121686 -3.801077 0.734229
H  4.057654 -1.783555 -0.066501
H  3.208198 2.426949 0.628793
H  4.798819 0.483581 0.727257
