program: Gaussian 09
title: 000102351
version: EM64L-G09RevD.01
frameworkgroup: C1[X(C6H8O)]
method: RPBEPBE
basis: SDD
operation: Freq
keyword: #p
keyword: freq=noraman
keyword: PBEPBE/SDD
title: #p freq=noraman PBEPBE/SDD
converged: YES YES NO NO
title: Mulliken charges:
elementType: O C C C C C C H H H H H H H H
charge: -0.234919 0.189707 -0.289727 -0.777362 -0.138349 -0.087085 -0.550602 0.224409 0.234330 0.234492 0.255431 0.266676 0.224663 0.222368 0.225967
chargesum: 0.00000
title: Mulliken charges with hydrogens summed into heavy atoms:
elementType: O C C C C C C
charge: -0.234919 0.189707 -0.065319 -0.053108 0.128327 0.137579 -0.102267
polarizability: 1.36807292e+02 -7.83065232e+00 6.45027044e+01 -2.84841246e-02 1.75196182e-02 3.35420447e+01
1716.lowfreq: -4.8553 -0.0003 -0.0001 0.0004 5.4346 20.6128 81.9537 92.2880 126.1499
frequency: 81.9142 92.2790 126.1437 180.0898 220.0426 315.4139 345.5442 497.2821 553.7377 590.9867 653.1620 879.1950 890.8251 929.2821 955.3413 969.8164 983.1039 1023.5744 1035.2276 1160.8088 1215.2165 1264.9481 1280.8815 1307.6352 1368.0498 1431.0784 1442.8295 1455.5159 1567.2424 1605.1881 1652.7674 2978.8633 3061.0176 3092.1407 3100.8508 3106.2838 3112.7456 3125.8837 3209.4364
redmass: 2.7045 1.0455 3.7623 2.2607 2.6462 2.9248 4.4738 2.7707 1.9499 4.1292 1.4914 1.5798 4.3763 1.6402 1.2261 1.4910 1.3876 1.6110 1.1982 1.7999 2.0240 1.6131 1.4699 1.5216 1.2534 1.2916 1.0949 1.0499 6.8818 4.0593 5.4641 1.0376 1.0964 1.0743 1.0792 1.0930 1.0881 1.0992 1.1150
irintensity: 1.7339 0.1110 1.9452 0.0016 0.0263 6.9121 2.7665 5.5655 2.0899 13.1693 3.7938 11.6173 0.0156 37.8932 48.8709 8.1320 22.4485 40.0070 44.7147 26.3996 34.1403 133.1776 0.5423 31.4295 69.7265 13.3825 26.3449 20.2292 198.3944 53.1107 56.9950 3.4467 15.4242 8.7107 3.4167 1.8894 20.7566 19.3166 17.7303
temp: 298.150 k
press: 1.00000 atm
elementType: 8 6 6 6 6 6 6 1 1 1 1 1 1 1 1
symmnumber: 1
zpe: 316187.0 jmol-1
zpe.correction: 0.120429 hartree
zpe.thermalcorrener: 0.128529 hartree
zpe.thermalcorrenthalpy: 0.129473 hartree
zpe.thermalcorrgfe: 0.087667 hartree
zpe.sumelectzpe: -308.092182 hartree
zpe.sumelectthermal: -308.084083 hartree
zpe.sumelectthermalent: -308.083138 hartree
zpe.sumelectthermalfe: -308.124944 hartree
dipole: -1.6352 -3.0190 0.0033
dipole: 3.4334
quadrupole: -35.9733 -42.9654 -44.7280
quadrupole: -5.9148 0.0011 0.0086
quadrupole: 5.2489 -1.7431 -3.5058 -5.9148 0.0011 0.0086
hfenergy: -308.2126116 hartree
pointgroup: C01 [X(C6H8O1)]
dipole: 0.668891 1.1599551 -0.1781179 debye
dipolederiv: -0.7640471 -0.0081504 0.0141882 -0.4451843 -0.8217078 0.0811973 0.0749489 0.0687098 -0.3348801 1.8698213 -0.1563197 -0.0302325 0.3606768 0.8485257 -0.108379 -0.1027325 -0.0933257 0.1476597 -1.2785028 -0.0047481 0.0308911 0.0729702 0.0737605 -0.0460667 0.0205215 -0.0438194 -0.2376785 -0.4004073 0.2495989 -0.020325 0.369722 -0.2359281 0.0283092 -0.0355087 0.0311956 0.0515347 0.5867453 -0.0165723 -0.0158632 -0.1411619 0.0573454 -0.009572 0.001548 -0.0133785 -0.0407983 -0.199697 -0.0231419 0.0049703 0.1733622 0.1535355 -0.0461238 -0.0228337 -0.0402619 -0.1350588 -0.0655978 0.0885106 -0.0210904 -0.0669284 0.0828672 -0.0622197 0.000449 -0.0667215 -0.3681769 0.0595026 -0.0128151 0.0051249 -0.0188421 -0.1117539 0.0400197 0.0061412 0.0398403 0.1673667 0.0714036 0.0096566 0.043714 -0.0096876 0.0756203 0.0896183 -0.0020399 0.1000431 -0.0583104 0.0688286 -0.0093483 -0.0494367 -0.0155288 0.0184825 -0.1091872 -0.0007655 -0.1202439 0.0018142 -0.0762906 -0.0476623 0.0119847 -0.1205187 0.0436328 0.014064 0.0215671 0.0122583 0.1201506 0.0696323 0.0012296 0.0023511 -0.012124 -0.0340047 0.0268324 0.0042371 0.0264842 0.15343 0.0424502 0.0329663 -0.001086 -0.0629456 -0.1120834 0.0403063 0.0123315 0.0374796 0.1587051 -0.0670437 -0.06257 0.0159555 -0.0719947 0.0506226 0.0210697 0.0173059 0.0207774 0.1837266 0.0832023 -0.0406339 0.0088539 -0.0118153 -0.0889147 0.0401315 0.0048299 0.0409627 0.1905154 unknown
polarizability: 136.3458994|-9.7144159|64.3657044|-1.6388208|-3.9821146|34.1404377 unknown
InChI: InChI=1S/C6H8O/c1-3-4-5-6(2)7/h3-5H,1H2,2H3
charge 0 multiplicity 1
15 atoms
O  -1.722358 -1.351547 0.273923
C  -1.61245 -0.099254 0.098272
C  -0.287132 0.567432 -0.033256
C  -2.838183 0.804144 0.011521
C  0.888515 -0.138391 0.030284
C  2.21371 0.454618 -0.090153
C  3.372188 -0.267895 -0.022367
H  -0.277204 1.655914 -0.184421
H  -2.857927 1.338707 -0.95759
H  -2.807389 1.574984 0.805397
H  -3.75662 0.207383 0.118116
H  0.816137 -1.22566 0.182902
H  2.264263 1.542577 -0.243035
H  4.354338 0.207194 -0.116476
H  3.358414 -1.354207 0.129583
