program: Gaussian 09
title: 000102347
version: EM64L-G09RevD.01
frameworkgroup: C1[X(C21H34O2)]
method: RPBEPBE
basis: SDD
operation: Freq
keyword: #pfreq=noraman
keyword: PBEPBE/SDD
title: #p freq=noraman PBEPBE/SDD
converged: YES YES NO NO
title: Mulliken charges:
elementType: O O C C C C C C C C C C C C C C C C C C C C C H H H H H H H H H H H H H H H H H H H H H H H H H H H H H H H H H H
charge: -0.455873 -0.198056 -0.109925 -0.104985 -0.189326 0.393989 0.392071 -0.083375 0.222574 -0.546681 -0.540939 -0.510081 -0.547472 -0.129272 -0.468837 -0.489353 -0.796907 -0.874499 -0.593694 -0.573355 -0.817434 0.176562 -0.769672 0.235557 0.196297 0.210428 0.217002 0.228854 0.208358 0.215410 0.194350 0.220684 0.200406 0.219284 0.220786 0.219635 0.198514 0.208734 0.243752 0.212942 0.216118 0.212429 0.241847 0.223887 0.223295 0.231141 0.222115 0.240698 0.238194 0.235126 0.224451 0.213495 0.243202 0.219962 0.226415 0.228804 0.322370
chargesum: 0.00000
title: Mulliken charges with hydrogens summed into heavy atoms:
elementType: O O C C C C C C C C C C C C C C C C C C C C C
charge: -0.133503 -0.198056 0.125632 0.091313 0.021102 0.393989 0.392071 0.133628 0.222574 -0.109469 -0.131179 -0.088992 -0.107402 0.090363 -0.061590 -0.032658 -0.126514 -0.196176 -0.130881 -0.100036 -0.136286 0.176562 -0.094492
polarizability: 2.66456547e+02 -8.16542733e-01 2.06303881e+02 -3.32564293e+00 -9.54995683e-01 1.83949814e+02
1716.lowfreq: -29.6491 -13.9255 -0.0006 -0.0006 0.0004 2.9696 30.7435 52.5399 67.8818
frequency: 30.5026 52.5255 67.8709 78.2489 107.8285 113.9548 129.3693 157.7896 176.8704 187.2571 201.9085 204.1144 226.9259 241.7904 248.5304 262.5688 274.1001 281.0381 296.5497 302.0247 314.0214 326.8112 343.0537 359.3977 364.4300 375.7865 388.7470 401.6380 422.4303 432.0890 448.5379 460.4718 464.2067 487.1971 512.0771 529.5980 546.6510 555.6674 565.6846 573.4257 624.7232 665.6597 688.7770 729.4112 787.9160 794.7054 806.7675 820.6000 824.3466 840.4627 851.6036 857.1230 894.9245 899.5277 912.8427 922.9648 932.0088 938.4959 953.7633 963.2531 982.5440 988.9923 994.9074 1004.7695 1012.0248 1018.3154 1035.7339 1042.6783 1060.2521 1068.3615 1074.2403 1076.5981 1082.0621 1097.5430 1101.2233 1121.4831 1130.2428 1137.4720 1139.3095 1154.0608 1158.3583 1170.0463 1185.0609 1198.9848 1205.5348 1212.6465 1221.1763 1225.4714 1231.0288 1243.5843 1251.3486 1257.2824 1269.1437 1270.5453 1275.7399 1280.0953 1293.0629 1302.8628 1314.0605 1314.7008 1319.8805 1325.3274 1329.4522 1334.1978 1335.0653 1338.1066 1346.1858 1347.5572 1359.9262 1363.3367 1383.0928 1390.5759 1392.6761 1394.3394 1437.8592 1448.7257 1455.6323 1463.8791 1465.0273 1466.2563 1467.9894 1469.4019 1471.2371 1477.0949 1478.9832 1481.6256 1485.5163 1487.3958 1490.9260 1494.9917 1630.0047 2916.2161 2926.4144 2947.6938 2948.0322 2953.3233 2966.1811 2967.5597 2970.7048 2970.9982 2974.7600 2979.8696 2983.6700 2988.2246 2991.8017 2992.1014 3000.0831 3011.7373 3012.9347 3018.9220 3029.2273 3041.1536 3050.0791 3054.9090 3060.5778 3061.1197 3065.8986 3069.0564 3076.6930 3078.9099 3080.7252 3082.8276 3086.1313 3098.3333 3539.1590
redmass: 4.8979 3.4215 4.5861 2.0894 2.6011 3.0420 2.5009 1.3933 1.8623 1.9346 1.5487 1.8073 2.3630 2.3590 2.2145 2.0518 1.3274 2.4896 1.1579 2.3698 2.8591 2.1353 3.1277 3.0728 2.6586 2.3409 3.0401 3.2161 2.3081 3.1290 3.0092 2.8975 2.9453 2.5108 2.9335 2.8669 2.6385 2.8179 2.6874 3.4827 3.4987 3.3023 2.6223 2.7675 1.6213 2.6200 2.6211 1.7621 1.9115 2.1040 2.2590 2.2100 1.8072 2.2523 1.6936 1.8014 1.7795 1.9132 1.8547 1.9223 2.2374 2.4490 1.7093 2.1862 1.7648 1.5277 2.0093 1.8586 2.1529 1.7161 1.4767 1.9661 1.8008 2.6794 2.1715 2.7009 2.1493 1.7207 1.9613 2.1573 2.2592 1.8924 1.6243 2.2623 1.9471 1.7880 1.5270 1.8380 1.5248 1.5110 1.4083 1.5699 1.6376 1.4589 1.4243 1.4546 1.3780 1.4006 1.4516 1.2755 1.8511 1.3589 1.3898 1.4899 1.4671 1.3890 1.3632 1.4439 1.4327 1.4761 1.2168 1.1949 1.2017 1.1977 1.0907 1.0846 1.0725 1.0766 1.0844 1.0682 1.0523 1.0634 1.0814 1.0572 1.0643 1.0500 1.0552 1.0695 1.0753 1.0605 9.2241 1.0801 1.0797 1.0667 1.0790 1.0596 1.0683 1.0744 1.0439 1.0568 1.0751 1.0373 1.0432 1.0635 1.0616 1.0619 1.0382 1.0948 1.0671 1.0971 1.1007 1.1007 1.0996 1.0961 1.0976 1.0984 1.0980 1.0979 1.0994 1.1027 1.0992 1.0971 1.0975 1.0984 1.0656
irintensity: 2.2597 1.0837 2.4752 0.3214 1.3615 0.6117 1.4505 0.4439 0.0874 0.6002 0.5434 1.8769 0.2954 0.2818 0.8647 8.7663 8.4437 8.5389 71.9523 6.8821 24.3702 13.2543 3.4653 2.2871 0.8036 2.4124 7.3516 1.3729 2.2628 1.3009 0.9045 7.6619 1.9721 2.4596 7.3975 1.9964 2.4665 4.0712 2.1816 1.1418 0.5831 0.8736 0.5262 2.8612 4.4364 3.9307 2.7979 0.1293 0.9936 2.1130 2.3569 1.1302 23.0585 26.4014 1.0534 1.0884 0.8456 0.8538 2.3045 6.6313 1.1816 0.1087 2.1922 6.8068 1.9780 3.0246 1.7716 7.5088 24.8769 12.6347 14.1982 35.0595 33.8922 0.5929 8.6235 13.9413 1.8754 1.1491 24.4473 5.6652 7.8695 14.3275 1.1508 7.5919 6.9596 4.6361 15.2044 23.3154 2.6861 8.3595 0.4853 8.1381 8.5183 7.9785 8.2088 20.2949 7.3022 0.7752 4.3936 3.5456 11.7013 1.0909 0.8813 2.1671 4.2196 1.5772 2.0718 1.9127 0.5739 5.0478 28.4437 1.6820 41.0768 20.4704 15.2726 17.4241 0.9954 9.6153 17.3438 16.3116 10.6816 1.7130 16.2013 4.0383 2.6749 9.6062 0.8474 6.4633 2.9791 8.9730 209.8922 11.1819 8.5728 19.3539 6.1013 42.7164 4.1580 25.6921 66.0756 17.8031 21.3848 36.2106 12.1484 4.8286 39.6585 45.1649 28.8207 56.2180 23.3343 39.8725 54.7404 60.3336 24.0482 28.8482 21.4294 20.1429 24.8385 51.7177 44.5286 47.1918 30.9646 33.4551 29.3676 36.2275 3.7136
temp: 298.150 k
press: 1.00000 atm
elementType: 8 8 6 6 6 6 6 6 6 6 6 6 6 6 6 6 6 6 6 6 6 6 6 1 1 1 1 1 1 1 1 1 1 1 1 1 1 1 1 1 1 1 1 1 1 1 1 1 1 1 1 1 1 1 1 1 1
symmnumber: 1
zpe: 1331177.0 jmol-1
zpe.correction: 0.507019 hartree
zpe.thermalcorrener: 0.529966 hartree
zpe.thermalcorrenthalpy: 0.530911 hartree
zpe.thermalcorrgfe: 0.457741 hartree
zpe.sumelectzpe: -969.264928 hartree
zpe.sumelectthermal: -969.241980 hartree
zpe.sumelectthermalent: -969.241036 hartree
zpe.sumelectthermalfe: -969.314205 hartree
dipole: -2.2601 -0.7962 0.7572
dipole: 2.5130
quadrupole: -186.5315 -135.0517 -142.0262
quadrupole: 3.6389 14.7952 -0.4769
quadrupole: -31.9951 19.4848 12.5103 3.6389 14.7952 -0.4769
hfenergy: -969.7719468 hartree
pointgroup: C01 [X(C21H34O2)]
dipole: 0.887989 -0.3256491 -0.2880269 debye
polarizability: 266.4443484|0.5829957|206.3415316|-3.5277334|0.1327408|183.9243623 unknown
InChI: InChI=1S/C21H34O2/c1-13-11-15(22)12-14-5-6-16-17-8-10-20(3,23)19(17,2)9-7-18(16)21(13,14)4/h13-14,16-18,23H,5-12H2,1-4H3
charge 0 multiplicity 1
57 atoms
O  5.249088 -0.912413 -0.428817
O  -5.778699 -0.015162 0.906142
C  0.555138 0.955712 -0.250129
C  -0.279847 -0.340445 0.035265
C  1.98184 0.758376 0.30342
C  2.727488 -0.471426 -0.306056
C  -1.780917 -0.221478 -0.442455
C  -2.393345 1.049702 0.250973
C  4.149086 -0.323048 0.377298
C  0.443696 -1.614927 -0.48922
C  1.904439 -1.740071 0.026565
C  -0.125412 2.19901 0.371494
C  3.005277 1.915283 0.170803
C  -2.62222 -1.487504 -0.006026
C  -1.598088 2.336933 -0.067158
C  4.393335 1.223788 0.373838
C  2.912947 -0.348665 -1.844591
C  -1.839603 -0.108288 -1.994529
C  -3.907641 1.238908 -0.045431
C  -4.133713 -1.305816 -0.363592
C  4.239547 -0.916516 1.800406
C  -4.71508 -0.025942 0.228343
C  -2.49693 -1.882315 1.487502
H  0.623524 1.120569 -1.345461
H  -0.308846 -0.420471 1.146195
H  1.860102 0.550132 1.391748
H  -2.29691 0.88783 1.346737
H  0.441238 -1.621252 -1.595651
H  -0.114565 -2.517429 -0.17402
H  1.874639 -1.890338 1.124668
H  2.37097 -2.646747 -0.412628
H  0.439649 3.111588 0.099935
H  -0.082146 2.115877 1.479149
H  2.830914 2.717397 0.909498
H  2.935312 2.378599 -0.831889
H  -2.260432 -2.346459 -0.607177
H  -2.068669 3.195452 0.452795
H  -1.654332 2.559137 -1.152155
H  5.099609 1.460841 -0.440131
H  4.870046 1.539477 1.318996
H  3.418244 -1.24709 -2.240434
H  1.948598 -0.243543 -2.369166
H  3.5457 0.513065 -2.115237
H  -1.591974 -1.076956 -2.466386
H  -2.840832 0.182381 -2.358193
H  -1.128397 0.639244 -2.384021
H  -4.042446 1.514478 -1.112637
H  -4.323281 2.064832 0.559497
H  -4.72634 -2.165665 -0.004005
H  -4.249551 -1.25821 -1.465036
H  3.485092 -0.484174 2.482047
H  4.102765 -2.015235 1.798845
H  5.2397 -0.699279 2.215446
H  -3.12658 -2.767691 1.692674
H  -1.460545 -2.142749 1.764506
H  -2.840211 -1.079145 2.16496
H  5.184368 -1.900756 -0.374115
