program: Gaussian 09
title: 000102337
version: EM64L-G09RevD.01
frameworkgroup: C1[X(C14H16N2O3)]
method: RPBEPBE
basis: SDD
operation: Freq
keyword: #p
keyword: freq=noraman
keyword: PBEPBE/SDD
title: #p freq=noraman PBEPBE/SDD
converged: YES YES NO NO
title: Mulliken charges:
elementType: O O O N N C C C C C C C C C C C C C C H H H H H H H H H H H H H H H H
charge: -0.261821 -0.245448 -0.290887 -0.412633 -0.390094 -0.587516 0.402970 -0.122734 0.091880 0.232236 -0.415891 -0.392821 0.186798 -0.351859 -0.275749 -0.217545 0.244941 -0.779799 -0.501868 0.239295 0.269917 0.289595 0.262737 0.303608 0.340581 0.257963 0.226139 0.223763 0.220835 0.257600 0.251706 0.217981 0.237671 0.247447 0.241000
chargesum: 0.00000
title: Mulliken charges with hydrogens summed into heavy atoms:
elementType: O O O N N C C C C C C C C C C C C C C
charge: -0.261821 -0.245448 -0.290887 -0.109025 -0.049514 -0.078303 0.402970 0.166860 0.091880 0.232236 -0.153154 -0.134858 0.186798 -0.125720 -0.051985 0.003291 0.244941 -0.052511 0.224250
polarizability: 2.05160993e+02 2.59947307e+01 1.79284782e+02 1.98667899e+01 -1.22233535e+01 1.21076370e+02
1716.lowfreq: -9.1127 -3.9103 0.0001 0.0005 0.0009 4.5715 16.3280 40.1331 50.2313
frequency: 15.9814 40.1214 50.1939 56.7330 77.8657 90.8176 100.8591 110.3589 116.2916 131.1925 164.7007 197.6586 217.4902 236.8289 279.6059 305.8729 329.2173 347.4027 426.2514 452.6928 459.4325 493.4235 510.0444 543.2527 555.6431 574.4064 577.1877 600.9667 619.4272 633.8200 664.3635 692.2627 746.8424 750.9525 753.9052 775.8798 804.7593 830.9552 857.9916 866.1766 904.5491 925.6683 939.4325 950.6217 978.5175 988.1775 996.3347 1012.0505 1043.3695 1071.0496 1095.0139 1113.1673 1126.4380 1133.3441 1150.9884 1161.7739 1167.8547 1182.6015 1234.9226 1241.0806 1247.7019 1261.8887 1296.3862 1329.1109 1342.8032 1355.3762 1385.1368 1393.2802 1422.3249 1423.8619 1449.3945 1453.4888 1457.8455 1464.3061 1465.5543 1470.5919 1483.4011 1491.3254 1558.4119 1585.4819 1601.0887 1630.9249 1633.4721 2993.9060 3002.4496 3006.8592 3018.7561 3077.6390 3085.8297 3109.5768 3115.0880 3122.0232 3129.9228 3143.1931 3154.1587 3160.6621 3215.3132 3518.9613 3613.0877
redmass: 5.1173 5.0432 5.4828 6.0235 5.3042 1.3544 2.1182 1.5195 2.1509 3.7717 4.3348 5.0820 4.0171 3.7351 5.5680 3.3544 4.1138 4.3487 2.9413 3.2482 3.8751 3.8791 1.3072 5.0652 5.1367 3.2694 2.9038 4.2523 1.8157 1.8696 3.9196 5.0321 3.3713 4.6356 1.4316 2.8422 2.1213 3.7299 1.4610 5.1945 4.5032 2.4074 1.3750 6.6179 1.2908 1.7813 2.4340 2.2007 1.6528 3.7045 1.5965 1.2668 2.8614 1.5471 1.4355 2.4989 1.1807 1.3623 1.3583 2.3034 1.6425 1.4441 2.0897 2.0651 1.4335 1.7556 1.2377 4.9174 1.8822 1.3688 1.1058 1.0511 3.2161 1.0593 1.0932 1.1754 2.9925 2.1181 6.0744 6.1256 6.9444 6.8173 8.3986 1.0367 1.0783 1.0305 1.0632 1.1028 1.0982 1.1047 1.0997 1.0848 1.0892 1.0955 1.1050 1.1001 1.0982 1.0781 1.0809
irintensity: 0.2720 0.3863 0.8457 1.6970 11.7923 1.5706 3.0014 2.2358 0.4055 11.4214 4.0540 1.4341 9.1029 11.7522 7.4382 0.9015 0.3147 12.3871 11.8374 4.3764 8.5784 8.5237 84.9931 3.8108 6.6917 42.0136 7.3240 20.0101 51.1113 41.3280 6.2490 0.8547 9.6691 5.5350 107.9034 8.4739 18.0996 5.0623 1.9398 0.9975 4.5802 4.3326 5.2050 30.2891 0.9659 4.4627 3.1104 10.5458 17.8455 14.4839 41.6893 0.9695 23.6403 15.2004 0.5204 191.6339 3.6005 55.4578 12.0578 9.5064 1.6450 8.0199 1.1031 85.9539 12.0555 43.5995 61.4300 23.2171 1.5649 30.7289 41.9533 13.0253 9.9715 14.0135 41.0514 16.6698 2.6833 206.4441 6.0052 1.7010 213.8329 2.0360 88.4614 8.6124 18.8139 26.9116 24.4221 6.0679 16.3565 25.8645 12.0442 0.1762 5.7330 27.8868 13.6659 29.1830 2.3395 55.4467 57.3815
temp: 298.150 k
press: 1.00000 atm
elementType: 8 8 8 7 7 6 6 6 6 6 6 6 6 6 6 6 6 6 6 1 1 1 1 1 1 1 1 1 1 1 1 1 1 1 1
symmnumber: 1
zpe: 730603.5 jmol-1
zpe.correction: 0.278272 hartree
zpe.thermalcorrener: 0.296781 hartree
zpe.thermalcorrenthalpy: 0.297726 hartree
zpe.thermalcorrgfe: 0.229593 hartree
zpe.sumelectzpe: -876.903524 hartree
zpe.sumelectthermal: -876.885015 hartree
zpe.sumelectthermalent: -876.884070 hartree
zpe.sumelectthermalfe: -876.952203 hartree
dipole: -1.5660 -4.7069 2.2441
dipole: 5.4445
quadrupole: -96.9661 -99.9837 -118.7107
quadrupole: 6.7621 5.3377 5.0276
quadrupole: 8.2541 5.2365 -13.4905 6.7621 5.3377 5.0276
hfenergy: -877.1817959 hartree
pointgroup: C01 [X(C14H16N2O3)]
dipole: 0.184089 1.9478249 0.8720321 debye
polarizability: 193.404556|28.779285|191.7294342|-21.2840815|7.47931|120.3881544 unknown
InChI: InChI=1S/C14H16N2O3/c1-9(17)16-13(14(18)19-2)7-10-8-15-12-6-4-3-5-11(10)12/h3-6,8,13,15-16H,7H2,1-2H3
charge 0 multiplicity 1
35 atoms
O  3.266258 1.639799 -0.39445
O  2.523102 0.851849 1.665695
O  1.185412 -3.012627 -1.066215
N  -1.686399 2.391405 0.179194
N  1.398653 -1.35112 0.535741
C  0.896713 0.193046 -1.425799
C  -0.302359 0.843933 -0.786935
C  1.952664 -0.375562 -0.405692
C  -1.563329 0.199742 -0.451126
C  -2.411172 1.193781 0.15509
C  -0.422317 2.177767 -0.391063
C  -2.065779 -1.118447 -0.626744
C  2.593085 0.738119 0.4187
C  -3.722267 0.905283 0.596002
C  -3.37303 -1.410758 -0.193251
C  -4.191224 -0.411628 0.415596
C  1.048054 -2.625523 0.139195
C  0.461907 -3.516698 1.228255
C  3.936645 2.764088 0.306405
H  1.43485 0.900618 -2.081372
H  0.586648 -0.666471 -2.045746
H  2.737574 -0.867151 -1.013811
H  0.294393 2.992364 -0.485487
H  -2.026806 3.279458 0.540145
H  1.286689 -1.040368 1.505025
H  -1.449546 -1.890317 -1.102187
H  -4.357241 1.670277 1.057244
H  -3.776803 -2.420329 -0.329301
H  -5.203953 -0.672146 0.743232
H  -0.637305 -3.550117 1.115552
H  0.844278 -4.541775 1.097783
H  0.694991 -3.165589 2.248281
H  4.359305 3.381752 -0.497706
H  4.72856 2.376532 0.968664
H  3.206047 3.329711 0.908584
