program: Gaussian 09
title: 000102409
version: EM64L-G09RevD.01
frameworkgroup: C1[X(C23H34O3)]
method: RPBEPBE
basis: SDD
operation: Freq
keyword: #pfreq=noraman
keyword: PBEPBE/SDD
title: #p freq=noraman PBEPBE/SDD
converged: NO YES NO NO
title: Mulliken charges:
elementType: O O O C C C C C C C C C C C C C C C C C C C C C C C H H H H H H H H H H H H H H H H H H H H H H H H H H H H H H H H H H
charge: -0.283125 -0.236281 -0.239722 -0.115188 0.380412 -0.159029 -0.097463 0.230244 -0.531814 -0.536367 -0.112964 -0.554236 -0.480563 -0.460844 0.540464 -0.817511 -0.640840 -0.493684 -0.811244 -0.562817 -0.586372 0.178379 0.253267 -0.502243 -0.351066 -0.683484 0.213701 0.233434 0.203392 0.201534 0.220291 0.218503 0.226602 0.259836 0.215574 0.228961 0.227128 0.218139 0.223310 0.238824 0.228612 0.242159 0.217562 0.222008 0.235575 0.218873 0.215130 0.220984 0.227980 0.234547 0.245273 0.231269 0.255278 0.238579 0.230103 0.230443 0.208614 0.223666 0.209534 0.208670
chargesum: 0.00000
title: Mulliken charges with hydrogens summed into heavy atoms:
elementType: O O O C C C C C C C C C C C C C C C C C C C C C C C
charge: -0.283125 -0.236281 -0.239722 0.098513 0.380412 0.074406 0.105929 0.230244 -0.109989 -0.091261 0.146872 -0.109701 -0.035296 0.001289 0.540464 -0.129177 -0.183256 -0.059681 -0.127733 -0.086275 -0.331093 0.178379 0.253267 -0.033560 0.087990 -0.041614
polarizability: 3.37267833e+02 -6.67025143e+00 2.24773212e+02 -1.57258647e+01 -1.19608439e+00 1.96923313e+02
1716.lowfreq: -14.6963 -13.4889 -7.8361 -6.2464 -0.0011 -0.0005 0.0006 23.0171 29.8689
frequency: -13.2268 22.8603 29.7686 34.3302 48.7049 53.3543 85.4424 93.9047 115.9729 139.8585 142.5650 159.7613 166.6723 181.8932 205.5856 209.3474 221.6532 232.0624 233.9736 249.5602 260.6426 265.5423 277.9641 300.8613 304.7552 317.5846 351.5444 362.4165 371.7576 385.6108 406.7081 425.7230 450.1075 469.4347 492.6394 505.2492 526.7505 535.4985 546.0813 552.1650 566.8792 598.8615 622.0288 644.0371 671.4945 689.8558 729.0183 738.4540 745.4727 774.4784 802.7906 824.3184 830.2384 840.7256 857.8221 866.4172 875.7231 881.6826 896.9767 912.7961 917.9715 924.1917 937.9251 952.5394 956.6937 969.0477 974.4492 997.8566 1001.3054 1022.7628 1028.6605 1032.7759 1043.0743 1048.8720 1055.9532 1076.2076 1076.8020 1086.2428 1092.2876 1108.9127 1115.9188 1116.7139 1123.8589 1129.5547 1135.1620 1144.9592 1160.7283 1179.1516 1186.6856 1190.1461 1206.1417 1209.2868 1213.8769 1220.0500 1230.3214 1237.3491 1247.0017 1257.3573 1270.1985 1273.5611 1278.8897 1279.5052 1287.1537 1292.4987 1297.5517 1303.2444 1319.3120 1322.4299 1325.4517 1332.1463 1333.1002 1340.5066 1344.9274 1348.2835 1352.4115 1354.4874 1356.3202 1369.1617 1391.2579 1392.8716 1394.0875 1441.4251 1442.3358 1457.4660 1459.2557 1465.4487 1466.4880 1469.7644 1472.5855 1475.3094 1479.5961 1480.6604 1483.8783 1486.7203 1486.8362 1491.4937 1494.3487 1584.3745 1622.3351 1636.2771 2908.9944 2916.5452 2951.9382 2959.9697 2961.1996 2971.2483 2974.3752 2976.1175 2977.4468 2980.1563 2987.0313 2992.3687 2994.5679 2997.9694 2999.0165 3011.4483 3019.1735 3026.3905 3034.9466 3039.4826 3040.3245 3042.9779 3050.7206 3055.9404 3058.7191 3062.6047 3077.1938 3077.5851 3079.4979 3084.2638 3084.8164 3089.2265 3092.7988 3118.1133
redmass: 2.6089 5.4345 5.1758 2.8145 3.9000 2.8910 3.0484 3.1438 2.6364 2.4690 3.2451 5.1929 2.0878 1.8088 2.0931 2.3510 1.7871 1.2412 1.9482 2.9480 2.4746 2.4992 2.3341 3.4366 3.0948 3.1745 3.1788 2.4919 3.3184 2.5384 3.1596 3.6180 3.3111 3.0820 2.9008 3.5512 2.7212 2.6653 3.5648 2.7589 3.1169 3.4015 3.6521 3.6378 3.5065 3.5098 2.1707 1.6689 1.8050 2.1491 2.1847 2.0805 1.9862 2.1031 2.0912 1.4083 2.7991 1.4998 1.8398 1.9928 2.1872 1.8033 1.9790 2.0420 2.1066 2.2186 3.5796 2.2635 1.9754 2.0949 1.9169 1.9363 2.1945 2.2017 2.3936 2.4672 2.4894 1.8439 1.6428 2.3299 2.5273 2.0662 1.8844 1.5674 2.0159 2.4584 2.2900 1.3843 1.8164 1.8250 1.8766 1.3794 1.4897 1.3425 1.4381 1.6116 1.3791 1.4531 1.5308 1.2328 2.0362 1.4324 1.4295 1.3992 1.3186 1.4855 1.4745 1.4784 1.3691 1.3675 1.3447 1.5821 2.0026 1.3981 1.4625 1.4037 1.6294 1.4822 1.2035 1.2117 1.2149 1.0785 1.0854 1.0869 1.0741 1.0854 1.0779 1.0883 1.0744 1.0490 1.0462 1.0790 1.0567 1.0581 1.0762 1.0701 1.0711 10.0291 7.7172 10.1168 1.0805 1.0805 1.0663 1.0729 1.0661 1.0666 1.0368 1.0657 1.0646 1.0611 1.0384 1.0559 1.0600 1.0415 1.0618 1.0854 1.0632 1.0962 1.0961 1.0983 1.0962 1.0998 1.0999 1.1011 1.0974 1.0955 1.0992 1.0989 1.1011 1.0988 1.0995 1.1012 1.0988 1.0911
irintensity: 0.0438 1.3984 1.3372 0.4174 2.2772 0.9928 0.5748 0.4423 0.5229 1.2290 1.1273 2.3590 0.6559 1.0320 2.0614 0.9446 0.6251 0.2520 0.9887 4.5777 2.6366 0.1174 1.6847 5.7004 2.2733 2.4722 2.1118 0.2255 5.3484 0.0871 0.4068 0.6615 3.0329 0.0361 1.0838 4.8502 0.2313 1.3262 1.4254 1.2901 2.9762 0.8378 1.3808 0.3524 8.4623 3.9804 1.2627 6.0416 5.6699 6.6314 0.5146 0.3553 6.5824 2.8904 9.8210 2.0048 1.9287 16.9677 1.1967 3.1017 13.4421 5.9212 41.1644 2.1133 10.7551 3.3696 85.4933 63.7007 4.6833 8.2035 4.9788 1.6925 46.5600 6.4026 3.5238 16.0181 1.4034 101.2628 0.6901 25.0492 0.2715 5.9573 8.1934 13.1366 32.5237 268.1163 0.2668 10.0016 15.5771 8.9095 1.5495 6.9074 2.7914 7.0066 25.1158 13.5755 2.2713 1.6191 4.3510 32.5156 36.9980 0.9600 0.7489 3.8993 56.4565 1.3279 1.8207 9.9040 4.3086 0.9317 0.9173 6.4681 7.7131 0.3908 7.3553 2.3666 20.9700 4.6481 3.8246 42.8354 6.4498 17.8638 18.3440 21.8588 1.7760 10.0959 7.0899 8.7889 7.9288 5.5806 12.6425 3.3525 6.1905 2.0918 15.8213 12.4444 9.5893 161.8173 208.2179 167.6074 7.0997 17.1306 16.0085 11.0585 33.2917 43.0184 38.1013 13.1443 5.7063 36.3147 16.9655 14.2890 27.9506 33.7003 25.0910 8.7665 33.3226 33.9307 45.4396 20.5666 1.3599 65.8887 34.5821 17.2981 1.7535 22.7535 49.7798 40.6306 71.9990 11.0854 59.1406 20.6827 33.0475 10.9709
temp: 298.150 k
press: 1.00000 atm
elementType: 8 8 8 6 6 6 6 6 6 6 6 6 6 6 6 6 6 6 6 6 6 6 6 6 6 6 1 1 1 1 1 1 1 1 1 1 1 1 1 1 1 1 1 1 1 1 1 1 1 1 1 1 1 1 1 1 1 1 1 1
symmnumber: 1
zpe: 1371915.1 jmol-1
zpe.correction: 0.522535 hartree
zpe.thermalcorrener: 0.547740 hartree
zpe.thermalcorrenthalpy: 0.548684 hartree
zpe.thermalcorrgfe: 0.467682 hartree
zpe.sumelectzpe: -1120.519032 hartree
zpe.sumelectthermal: -1120.493827 hartree
zpe.sumelectthermalent: -1120.492883 hartree
zpe.sumelectthermalfe: -1120.573885 hartree
dipole: -4.0067 0.4383 3.7881
dipole: 5.5313
quadrupole: -206.3555 -150.8455 -164.1921
quadrupole: 11.1395 6.5028 -0.2144
quadrupole: -32.5578 22.9522 9.6056 11.1395 6.5028 -0.2144
hfenergy: -1121.0415668 hartree
pointgroup: C01 [X(C23H34O3)]
dipole: -1.5675743 0.0636806 -1.5081355 debye
polarizability: 337.1115053|3.6678739|224.451629|17.3641315|2.9961542|197.4012229 unknown
InChI: InChI=1S/C23H34O3/c1-4-5-21(25)26-20-9-8-18-17-7-6-15-14-16(24)10-12-22(15,2)19(17)11-13-23(18,20)3/h14,17-20H,4-13H2,1-3H3
charge 0 multiplicity 1
60 atoms
O  -3.834725 0.051088 -0.314851
O  6.991339 0.73009 1.529953
O  -5.071154 -0.696521 1.518909
C  -0.364618 -1.254191 -0.032345
C  -1.33634 -0.088367 -0.403447
C  1.076161 -1.027781 -0.532528
C  1.616646 0.304444 0.084445
C  3.112027 0.632955 -0.331038
C  -0.815662 1.202726 0.2676
C  0.64923 1.501111 -0.154854
C  -2.636921 -0.673122 0.200704
C  -1.131685 -2.53797 -0.454434
C  1.9987 -2.204825 -0.147891
C  -2.636505 -2.182667 -0.190578
C  3.984675 -0.609802 -0.074202
C  -1.502574 0.110617 -1.933411
C  3.46022 -1.940331 -0.581179
C  3.618582 1.826685 0.538215
C  3.224331 0.99755 -1.846843
C  5.150685 2.004665 0.53144
C  5.207226 -0.541839 0.546238
C  5.867833 0.718771 0.938287
C  -5.006333 -0.053757 0.445183
C  -6.14848 0.692149 -0.225294
C  -7.220152 1.178479 0.775671
C  -8.434074 1.805464 0.059641
H  -0.309433 -1.266419 1.082081
H  1.063007 -0.947378 -1.640447
H  1.646296 0.129409 1.18581
H  -0.860516 1.082674 1.370605
H  -1.458567 2.066962 0.010204
H  0.66501 1.789642 -1.222937
H  1.002938 2.382977 0.410549
H  -2.638459 -0.562843 1.302318
H  -0.810274 -3.422461 0.122496
H  -0.958486 -2.764806 -1.523511
H  1.640672 -3.141632 -0.615624
H  1.959919 -2.354961 0.950924
H  -3.250587 -2.327623 -1.097761
H  -3.082793 -2.794778 0.610312
H  -1.850609 -0.808698 -2.436188
H  -2.254261 0.895205 -2.125987
H  -0.55777 0.415975 -2.413845
H  3.496291 -1.938186 -1.691919
H  4.123174 -2.759186 -0.246899
H  3.288077 1.663329 1.584282
H  3.143256 2.763135 0.192965
H  2.803211 0.209088 -2.494949
H  2.689552 1.938416 -2.06637
H  4.280701 1.136603 -2.138612
H  5.467275 2.817163 1.209106
H  5.507188 2.281788 -0.482027
H  5.783645 -1.456806 0.737129
H  -5.734116 1.528023 -0.816717
H  -6.613675 -0.002966 -0.955049
H  -7.539542 0.324655 1.400729
H  -6.767216 1.915535 1.466445
H  -9.185111 2.160029 0.788402
H  -8.133352 2.669868 -0.562152
H  -8.928872 1.070543 -0.603351
