program: Gaussian 09
title: 000102323
version: EM64L-G09RevD.01
frameworkgroup: C1[X(C7H4N4O3)]
method: RPBEPBE
basis: SDD
operation: Freq
keyword: #pfreq=noraman
keyword: PBEPBE/SDD
title: #p freq=noraman PBEPBE/SDD
converged: YES YES YES YES
title: Mulliken charges:
elementType: O O O N N N N C C C C C C C H H H H
charge: -0.198070 -0.195603 -0.195276 0.028461 -0.117584 0.029706 0.011597 0.265633 0.393532 -0.278362 -0.318026 -0.350872 -0.346113 0.111844 0.287138 0.284044 0.293251 0.294700
chargesum: 0.00000
title: Mulliken charges with hydrogens summed into heavy atoms:
elementType: O O O N N N N C C C C C C C
charge: -0.198070 -0.195603 -0.195276 0.028461 -0.117584 0.029706 0.011597 0.265633 0.393532 0.008776 -0.033982 -0.057621 -0.051412 0.111844
polarizability: 2.29047663e+02 -6.42988406e+00 1.15018914e+02 -1.03460993e-04 -4.65851782e-05 4.24749367e+01
1716.lowfreq: -8.7836 -5.1861 -0.0011 -0.0010 -0.0006 0.9559 42.1492 60.1159 77.6988
frequency: 42.1305 60.1145 77.6983 87.8899 122.6718 177.5221 238.6204 254.4534 275.0543 409.6674 424.3100 452.8470 453.3729 497.8325 510.4314 526.8317 623.4816 646.7658 680.7491 684.5486 762.8196 764.1026 797.0423 864.5829 890.2862 948.9562 1007.2030 1008.0074 1012.6495 1088.5418 1109.9811 1176.2677 1207.9269 1220.7774 1262.1416 1294.4727 1369.9659 1406.1150 1413.9323 1473.7442 1583.4476 1607.3833 1609.4488 2067.5207 3165.2689 3171.7466 3188.6690 3191.5346
redmass: 12.0106 9.1061 7.1044 11.3890 11.2091 12.7215 10.6166 7.7489 9.5525 2.8853 8.6619 4.2772 12.6114 8.8259 12.7686 7.0175 7.1425 6.3630 3.9355 9.3104 11.9775 4.9585 9.7193 1.2417 1.6614 8.7326 1.3485 2.8444 1.3704 3.3481 1.2892 1.2422 6.3522 6.4004 7.9853 1.2948 7.6046 7.9762 4.7161 2.4018 10.0747 8.9661 6.7476 13.9934 1.0903 1.0895 1.0956 1.0971
irintensity: 0.0442 1.7723 2.9666 1.1845 1.9842 4.7550 1.5512 0.0552 1.6230 0.0075 8.0682 2.0865 2.9129 7.5008 1.2631 4.1953 0.8506 0.6927 57.9021 4.0569 49.6824 2.7313 31.6906 0.4892 58.4561 197.6713 0.3651 2.2264 0.0009 12.6890 18.5344 1.6431 333.1368 136.3346 579.3922 20.1305 83.1992 12.9910 67.0558 5.7104 94.9976 63.4679 23.6424 486.1286 1.4964 0.3818 0.9277 1.7984
temp: 298.150 k
press: 1.00000 atm
elementType: 8 8 8 7 7 7 7 6 6 6 6 6 6 6 1 1 1 1
symmnumber: 1
zpe: 292555.9 jmol-1
zpe.correction: 0.111429 hartree
zpe.thermalcorrener: 0.123157 hartree
zpe.thermalcorrenthalpy: 0.124101 hartree
zpe.thermalcorrgfe: 0.071936 hartree
zpe.sumelectzpe: -712.706798 hartree
zpe.sumelectthermal: -712.695070 hartree
zpe.sumelectthermalent: -712.694126 hartree
zpe.sumelectthermalfe: -712.746291 hartree
dipole: 2.1867 -0.8571 0.0005
dipole: 2.3487
quadrupole: -108.1057 -77.5391 -77.8384
quadrupole: -7.3723 -0.0011 -0.0007
quadrupole: -20.2780 10.2887 9.9894 -7.3723 -0.0011 -0.0007
hfenergy: -712.818227 hartree
pointgroup: C01 [X(C7H4N4O3)]
dipole: -0.8603901 0.3370746 0.0003261 debye
dipolederiv: -0.7411103 -0.279842 -0.0001184 0.2273482 -0.8927919 -0.0002423 0.0001012 -0.0002853 -0.2973392 -0.7116355 -0.1868866 -0.0000602 -0.176629 -0.6918326 -0.0001904 -0.0000265 -0.0000806 -0.2201533 -0.8012979 0.1888432 0.0000463 0.1460068 -0.6127561 -0.0000702 0.0001116 -0.0001905 -0.2197782 1.8463985 0.0565263 -0.0000027 0.1058599 1.0975538 0.0002553 0.0000362 0.0002871 0.1918023 -2.1985126 0.5710828 0.0002074 0.5893207 -0.4824072 -0.0001375 0.0001891 -0.0001226 -0.159377 2.2234484 -0.3323946 -0.0000921 0.148633 -0.1047068 -0.0001012 0.0001306 -0.0001122 0.1316935 -1.0986705 0.2283827 0.0000754 0.072988 -0.006274 0.0000149 0.0000008 0.0000184 -0.0336982 -0.6413337 -0.062894 -0.0000321 -0.0494379 0.0403864 0.0000144 -0.0000263 0.0000172 0.0037355 -0.5971427 -0.0679248 -0.0000011 -0.0666649 0.1257963 0.0000484 -0.0000457 0.0000335 0.075009 -0.0485611 -0.2000478 -0.0000877 -0.0147365 -0.0336148 0.0000263 0.0000094 0.0000227 -0.0952567 -0.0482481 0.2056365 0.0000914 -0.0665861 0.0448326 0.0000631 -0.0000231 0.0000675 -0.0946785 -0.0045591 0.2062227 0.0000918 -0.0395485 -0.0436006 0.0000373 -0.0000411 0.0000169 -0.1046419 -0.0024979 -0.1945508 -0.0000794 0.0611354 -0.0797284 0.0000056 -0.0000373 0.0000042 -0.10329 2.4256683 -0.1368707 -0.0000417 -1.0046906 1.4099179 0.0004727 -0.0004241 0.0005067 0.2693354 0.0851581 0.0519279 0.0000254 0.0942053 0.0453303 -0.0000474 0.0000517 -0.0000448 0.1544307 0.1121283 -0.0579431 -0.0000234 -0.0314456 0.0354866 -0.0000544 -0.0000008 -0.0000572 0.1553042 0.1111542 -0.0470976 -0.0000225 -0.0203558 0.0626364 -0.000053 -0.0000206 -0.0000426 0.1729397 0.0896136 0.05783 0.0000235 0.0245975 0.0857721 -0.0000413 0.0000149 -0.0000385 0.1739627 unknown
polarizability: 229.0499055|-6.4099682|115.0166591|-0.0030659|0.0297478|42.4749489 unknown
InChI: InChI=1S/C7H4N4O3/c8-10-9-7(12)5-1-3-6(4-2-5)11(13)14/h1-4H
charge 0 multiplicity 1
18 atoms
O  -2.620391 -1.67136 -0.000539
O  4.096585 1.446027 0.000567
O  4.381122 -0.817626 -0.000158
N  3.641879 0.239118 0.000368
N  -2.830528 0.70861 0.000519
N  -4.101792 0.657542 0.000454
N  -5.275061 0.759457 0.000467
C  -0.607109 -0.294801 0.00011
C  2.163333 0.052867 0.000279
C  -0.05991 1.015129 0.000697
C  0.248247 -1.428425 -0.000396
C  1.335328 1.196541 0.000778
C  1.643854 -1.260729 -0.000313
C  -2.079142 -0.538371 0.000003
H  -0.733335 1.876245 0.001081
H  -0.200051 -2.426674 -0.000847
H  1.789306 2.19051 0.001215
H  2.329663 -2.111461 -0.000686
