program: Gaussian 09
title: 000102293
version: EM64L-G09RevD.01
frameworkgroup: C1[X(C5H12O2)]
method: RPBEPBE
basis: SDD
operation: Freq
keyword: #pfreq=noraman
keyword: PBEPBE/SDD
title: #p freq=noraman PBEPBE/SDD
converged: YES YES NO NO
title: Mulliken charges:
elementType: O O C C C C C H H H H H H H H H H H H
charge: -0.440580 -0.463952 -0.041849 -0.383558 -0.372013 -0.368456 -0.696792 0.206201 0.238810 0.187357 0.199866 0.235363 0.203173 0.185435 0.213052 0.202504 0.220550 0.330555 0.344333
chargesum: 0.00000
title: Mulliken charges with hydrogens summed into heavy atoms:
elementType: O O C C C C C
charge: -0.110025 -0.119619 0.164352 0.042609 0.063216 0.020152 -0.060686
polarizability: 6.57015965e+01 -1.76865871e+00 6.39894222e+01 -4.21015507e-01 -1.65989687e+00 5.50880761e+01
1716.lowfreq: -19.0265 -0.0004 0.0003 0.0004 2.1062 4.7516 69.6714 95.4076 110.7854
frequency: 69.4340 95.3888 110.7708 184.4685 224.2097 237.5213 266.0260 279.7629 325.2092 428.6010 465.7248 501.3534 761.4960 822.0786 886.5134 946.6009 957.2308 974.5377 1004.4275 1041.5616 1076.3330 1109.2402 1124.0085 1175.2202 1216.8539 1219.9281 1268.7361 1306.9221 1314.2960 1336.9044 1360.9949 1374.4019 1390.8925 1404.3684 1470.2992 1475.9177 1477.2165 1478.8323 1486.3562 2930.6726 2961.2931 2972.8790 2974.7329 2994.6664 2999.3664 3032.6832 3067.0157 3069.9562 3071.8998 3562.0627 3574.9111
redmass: 1.9356 2.8831 2.9590 1.5075 2.3206 1.8881 1.4619 1.6689 1.2624 2.4251 3.1033 3.6078 1.3319 1.8469 1.6872 2.0595 1.6631 4.1239 2.2821 2.8935 1.3334 1.5795 1.8792 1.3904 1.3711 1.2623 1.2668 1.2004 1.2120 1.3817 1.3883 1.3032 1.2271 1.4068 1.0658 1.0702 1.0758 1.0549 1.0651 1.0592 1.0720 1.0725 1.0382 1.0727 1.0877 1.0970 1.1061 1.0998 1.0990 1.0661 1.0666
irintensity: 4.1205 7.7571 5.2181 0.9872 10.4687 47.1351 69.1697 33.5724 164.3646 5.1934 13.6029 11.3580 12.5780 7.4070 18.3911 7.5499 73.9584 63.0831 41.2048 1.0232 7.6987 10.6287 12.1550 6.8344 20.5533 7.3447 11.9439 10.0500 3.4096 8.8160 8.3931 6.8150 12.7165 0.6973 5.4757 5.7160 2.1360 15.1796 13.6392 51.4331 6.3019 45.5037 29.7926 11.6926 116.8931 4.9010 23.7003 69.2166 57.8439 5.3895 2.2377
temp: 298.150 k
press: 1.00000 atm
elementType: 8 8 6 6 6 6 6 1 1 1 1 1 1 1 1 1 1 1 1
symmnumber: 1
zpe: 435816.2 jmol-1
zpe.correction: 0.165994 hartree
zpe.thermalcorrener: 0.175391 hartree
zpe.thermalcorrenthalpy: 0.176336 hartree
zpe.thermalcorrgfe: 0.131873 hartree
zpe.sumelectzpe: -347.545199 hartree
zpe.sumelectthermal: -347.535801 hartree
zpe.sumelectthermalent: -347.534857 hartree
zpe.sumelectthermalfe: -347.579320 hartree
dipole: -0.2138 -2.8160 0.0723
dipole: 2.8250
quadrupole: -45.0445 -45.7086 -42.1873
quadrupole: -2.6303 1.0626 -5.0075
quadrupole: -0.7310 -1.3951 2.1262 -2.6303 1.0626 -5.0075
hfenergy: -347.7111922 hartree
pointgroup: C01 [X(C5H12O2)]
dipole: 0.4871382 -0.9949289 -0.0902987 debye
dipolederiv: -0.6772837 0.167965 0.007896 0.1738982 -0.7111271 -0.2487157 0.0123997 -0.2795184 -0.2409017 -0.6700572 -0.26174 -0.0220509 -0.2453157 -0.4556327 0.2250276 -0.0009452 0.2781174 -0.4822467 -0.0744248 0.0619245 -0.0002763 0.0202189 -0.0912176 -0.0272605 -0.0641363 0.0053333 0.0957275 0.0526545 0.0223466 -0.0067387 0.0374367 0.0197217 0.0121739 -0.0165419 0.0223019 0.1513955 0.3504396 -0.155173 -0.03514 -0.1145682 0.5176616 0.1568688 -0.0256193 0.1434448 0.3630769 0.4671993 0.2282474 -0.0236049 0.2082439 0.4333245 -0.1512852 -0.0203721 -0.1380419 0.3986251 -0.0745009 0.0043031 -0.0374208 -0.0067274 0.0811897 0.0253784 -0.0217596 0.0268384 0.0633741 0.0453387 0.0335023 -0.0011216 -0.0132844 0.0499788 -0.0044953 -0.0007288 -0.0000079 -0.1854661 0.0780933 0.0162992 -0.0172749 -0.0109273 -0.1269986 -0.0110102 -0.0217399 -0.0330197 0.0780152 0.0143387 -0.0073444 -0.0265015 0.009975 0.0874682 -0.0471685 0.0059991 -0.0031055 -0.2040277 0.0864458 0.0099633 0.0349099 0.0266083 0.0251842 0.0212374 -0.0191368 0.0086732 -0.1592722 -0.1276448 -0.0911574 0.0143979 -0.090759 -0.0187153 -0.0301552 0.0570173 -0.0021854 0.0553249 -0.1945359 0.0835146 0.0145905 0.1212412 -0.0387578 0.0280955 -0.014585 0.0547253 0.0359683 0.0026548 -0.0598029 -0.0293438 -0.0376386 0.0263202 0.0455639 0.0155422 0.0101566 -0.2384096 0.0741637 0.0168852 0.0415602 0.0159033 0.0842654 -0.0267561 -0.0293235 -0.025462 -0.1794144 0.0813512 0.0448743 -0.0109663 0.0962874 -0.177666 -0.0357659 -0.0031411 -0.0528759 0.0676382 -0.1310293 -0.1029481 0.0474144 -0.1355458 0.0143385 0.046038 0.0678248 0.0541174 0.0677418 0.3906113 -0.0472856 -0.0195543 -0.0394287 0.2465902 0.1290917 0.0201013 0.0778144 0.016294 0.3061856 0.0356258 0.0692251 -0.015618 0.0340719 -0.1068626 0.0591453 -0.1473059 0.2965569 unknown
polarizability: 64.2107374|1.9588957|65.2678984|-1.077299|1.885415|55.300459 unknown
InChI: InChI=1S/C5H12O2/c1-2-5(3-6)4-7/h5-7H,2-4H2,1H3
charge 0 multiplicity 1
19 atoms
O  -1.38111 2.016225 0.387253
O  -1.123812 -2.18316 0.308822
C  0.022708 -0.050137 0.142371
C  1.274704 0.712674 -0.362651
C  -1.277366 0.689486 -0.249839
C  -0.017427 -1.493497 -0.384605
C  2.599774 0.278405 0.30298
H  0.066528 -0.112534 1.251092
H  1.106522 1.789839 -0.172509
H  1.352274 0.598252 -1.464572
H  -1.281465 0.909255 -1.332857
H  -2.156275 0.061786 -0.00599
H  0.946616 -2.002549 -0.178897
H  -0.186311 -1.489246 -1.484972
H  2.549634 0.411136 1.400282
H  2.841421 -0.782791 0.105403
H  3.445794 0.884445 -0.069833
H  -1.483604 1.884811 1.363669
H  -1.156405 -3.129501 0.021752
