program: Gaussian 09
title: 000102216
version: EM64L-G09RevD.01
frameworkgroup: C1[X(C10H12N4O4)]
method: RPBEPBE
basis: SDD
operation: Freq
keyword: #p
keyword: freq=noraman
keyword: PBEPBE/SDD
title: #p freq=noraman PBEPBE/SDD
converged: YES YES NO NO
title: Mulliken charges:
elementType: O O O O N N N N C C C C C C C C C C H H H H H H H H H H H H
charge: -0.291707 -0.426258 -0.489476 -0.427284 -0.181742 -0.028609 0.048087 0.001985 -0.165944 -0.042717 -0.189973 -0.076211 -0.321221 0.285924 -0.191010 -0.121546 -0.318604 -0.376100 0.276520 0.240001 0.245541 0.260717 0.187059 0.221153 0.375877 0.372329 0.268840 0.249141 0.362374 0.252852
chargesum: 0.00000
title: Mulliken charges with hydrogens summed into heavy atoms:
elementType: O O O O N N N N C C C C C C C C C C
charge: -0.291707 -0.050381 -0.117147 -0.064910 -0.181742 -0.028609 0.048087 0.001985 0.110577 0.197284 0.055568 0.184506 0.086991 0.285924 0.077830 -0.121546 -0.069463 -0.123248
polarizability: 1.99951399e+02 -6.12130338e+00 1.32769117e+02 6.23671196e+00 -1.93292999e+01 9.77142675e+01
1716.lowfreq: -2.9277 -0.0009 -0.0008 -0.0003 6.3657 8.6024 13.2232 26.5600 53.5712
frequency: 13.1346 26.2955 53.5261 65.5288 96.5110 129.8577 164.2952 178.0564 223.1923 237.1815 250.9395 276.2237 302.9572 312.5609 352.2921 395.9916 416.8267 463.1146 496.7521 515.0711 531.1995 546.9193 571.6418 605.5596 618.2166 632.1198 656.3421 698.5047 759.6369 799.1728 802.4209 830.3785 845.0030 852.3833 866.3634 886.1031 937.9588 940.1379 957.6928 970.5034 1006.4918 1033.1941 1041.8295 1055.9693 1066.2395 1085.5430 1101.8979 1142.2917 1155.1392 1178.9691 1198.1679 1218.7480 1237.3819 1249.4652 1261.8294 1263.1766 1272.5763 1285.4790 1295.3358 1317.8517 1334.9328 1339.6997 1357.2091 1373.3108 1384.6458 1386.5884 1400.3027 1416.1058 1432.9469 1458.6975 1508.4099 1574.7599 2937.2359 3014.7702 3017.0388 3031.3574 3057.9376 3066.5499 3133.5661 3174.6517 3235.8761 3462.4486 3540.5665 3613.2901
redmass: 6.9539 6.7112 5.3122 6.2996 3.3430 4.9753 5.5327 5.5846 5.5956 1.3531 4.1989 3.7044 5.8260 4.1916 5.7207 4.3640 4.4807 1.1757 5.5533 2.4896 1.3079 7.6238 5.1499 5.1284 4.5810 3.7210 6.4371 4.8078 6.9287 5.1994 4.0422 4.4015 1.6205 6.1866 2.9017 1.4935 1.4937 5.7356 2.9938 3.0274 3.6545 3.4759 2.4919 4.7602 3.3265 2.9609 2.9545 4.2906 1.3365 1.1943 2.1061 1.3465 1.4028 1.2559 2.9555 1.6265 2.0387 3.1231 1.5746 1.6287 1.2508 2.0082 1.3909 1.2569 1.2682 3.0072 1.4431 1.6428 4.3545 1.0905 9.3619 7.6726 1.0692 1.0860 1.0866 1.0860 1.0874 1.0945 1.0930 1.0926 1.0982 1.0643 1.0656 1.0673
irintensity: 0.0623 0.4617 3.4062 0.5999 7.4528 3.2386 0.8046 0.9146 0.6366 120.1729 8.7318 11.6715 13.1795 8.4901 4.8621 0.4180 1.9114 152.7435 17.9213 28.5154 92.1036 8.5090 22.0610 12.4455 10.5862 3.0914 1.1642 39.9364 10.0054 3.3815 23.0490 23.0462 25.4136 16.3205 22.2122 26.2100 4.9258 180.0778 66.4295 41.4205 96.9290 18.0257 20.9970 93.3336 29.4401 18.3755 10.1865 13.1954 42.9102 23.6012 89.2265 19.3604 4.8324 14.9023 43.1382 16.4330 12.5170 19.8791 6.0329 56.0021 8.2702 3.2407 16.3955 23.7365 39.0687 132.6632 12.0519 2.5050 146.3390 7.1088 24.5307 32.5390 59.1550 25.8277 13.9038 21.5000 18.7405 44.0129 16.8905 15.2572 0.5512 52.3302 13.0278 28.5240
temp: 298.150 k
press: 1.00000 atm
elementType: 8 8 8 8 7 7 7 7 6 6 6 6 6 6 6 6 6 6 1 1 1 1 1 1 1 1 1 1 1 1
symmnumber: 1
zpe: 592145.8 jmol-1
zpe.correction: 0.225536 hartree
zpe.thermalcorrener: 0.241377 hartree
zpe.thermalcorrenthalpy: 0.242321 hartree
zpe.thermalcorrgfe: 0.179975 hartree
zpe.sumelectzpe: -906.769575 hartree
zpe.sumelectthermal: -906.753734 hartree
zpe.sumelectthermalent: -906.752790 hartree
zpe.sumelectthermalfe: -906.815136 hartree
dipole: 8.5051 3.9733 -0.6774
dipole: 9.4118
quadrupole: -108.3714 -115.9127 -110.4181
quadrupole: 9.1920 6.9363 -2.6566
quadrupole: 3.1960 -4.3453 1.1493 9.1920 6.9363 -2.6566
hfenergy: -906.9951114 hartree
pointgroup: C01 [X(C10H12N4O4)]
dipole: 3.3353917 1.5964645 -0.1947101 debye
polarizability: 199.8459679|-5.3381232|133.2069176|7.8409904|-18.8490689|97.3818985 unknown
InChI: InChI=1S/C10H12N4O4/c15-2-6-7(16)8(17)10(18-6)14-4-13-9-5(14)1-11-3-12-9/h1,3-4,6-8,10,15-17H,2H2
charge 0 multiplicity 1
30 atoms
O  1.659832 -0.526614 -0.847848
O  1.01739 2.325902 1.403004
O  3.008879 2.369256 -0.310565
O  3.670468 -2.510889 -0.757327
N  -0.494457 -0.260838 0.126493
N  -1.857974 -1.878111 1.040088
N  -4.003001 -0.900348 0.257561
N  -3.771875 1.177204 -1.041383
C  1.516657 1.041983 0.978731
C  0.729537 0.438705 -0.227118
C  2.967466 1.094345 0.428082
C  3.069179 -0.134136 -0.50144
C  3.726483 -1.364694 0.142574
C  -1.80644 0.10167 -0.209723
C  -0.599208 -1.451274 0.871318
C  -2.645574 -0.91592 0.371858
C  -2.413449 1.157444 -0.916571
C  -4.487753 0.156617 -0.453496
H  1.446386 0.3666 1.848358
H  0.475562 1.244347 -0.942191
H  3.725535 1.083615 1.234293
H  3.579102 0.112714 -1.45089
H  3.236807 -1.590488 1.116387
H  4.800952 -1.181793 0.318963
H  1.455159 3.007388 0.820341
H  3.933307 2.606873 -0.563078
H  0.280542 -1.976505 1.236455
H  -1.860777 1.982259 -1.379704
H  2.728971 -2.621924 -1.052397
H  -5.573408 0.20791 -0.573376
