program: Gaussian 09
title: 000102223
version: EM64L-G09RevD.01
frameworkgroup: C1[X(C19H19N2S2)]
method: RPBEPBE
basis: SDD
operation: Freq
keyword: #p
keyword: freq=noraman
keyword: PBEPBE/SDD
title: #p freq=noraman PBEPBE/SDD
converged: YES YES NO NO
title: Mulliken charges:
elementType: S S N N C C C C C C C C C C C C C C C C C C C H H H H H H H H H H H H H H H H H H H
charge: 0.293161 0.293216 -0.208978 -0.209116 -0.034386 -0.034248 0.608903 0.609325 -0.181480 -0.395191 -0.394626 -0.349431 -0.349719 -0.336910 -0.337237 -0.270667 -0.270539 -0.646392 -0.646080 -0.212539 -0.212283 -0.228118 -0.228228 0.255319 0.234546 0.251325 0.234226 0.250997 0.254595 0.254344 0.264709 0.264702 0.231368 0.248084 0.246893 0.248039 0.231505 0.246853 0.253967 0.253949 0.258050 0.258094
chargesum: 1.00000
title: Mulliken charges with hydrogens summed into heavy atoms:
elementType: S S N N C C C C C C C C C C C C C C C C C C C
charge: 0.293161 0.293216 -0.208978 -0.209116 -0.034386 -0.034248 0.608903 0.609325 0.073839 0.090680 0.090598 -0.349431 -0.349719 -0.082315 -0.082893 -0.005959 -0.005838 0.079953 0.080316 0.041427 0.041667 0.029932 0.029865
polarizability: 5.54847463e+02 2.99435649e-02 2.59754784e+02 6.13498573e+00 -1.43287534e-01 1.10959775e+02
1716.lowfreq: -10.0440 0.0015 0.0022 0.0028 0.9109 1.9619 21.1200 33.1429 56.0401
frequency: 20.9268 33.1283 56.0375 70.7924 71.3128 76.0195 83.0470 102.0966 162.8704 170.0492 180.7243 200.8585 205.8255 212.7010 215.7959 260.2134 285.8580 315.6323 333.2548 384.2983 404.5864 411.8046 414.2720 430.2729 438.1364 489.3884 496.1850 504.6801 519.0079 527.7977 530.1815 539.3840 592.9502 605.6901 620.0044 621.6616 680.6711 686.7509 711.6457 721.0761 721.8007 760.8419 761.2404 768.5116 772.4050 776.4142 826.2238 837.2988 855.4349 855.5425 930.3261 937.6414 948.8339 948.9616 995.7424 995.7500 1022.7743 1024.1009 1025.2538 1030.9189 1049.1578 1055.4733 1087.5043 1090.5625 1134.7876 1138.5413 1141.6221 1141.7121 1182.9833 1184.0325 1222.1203 1229.1874 1262.2035 1271.4315 1282.5092 1300.5309 1310.9203 1335.0710 1343.1816 1345.3422 1354.2665 1399.7631 1399.8340 1401.5500 1402.0352 1438.7707 1448.6320 1455.2931 1456.7443 1467.0126 1468.8383 1473.1574 1484.1355 1484.9448 1513.5661 1513.6056 1577.5510 1591.5489 1597.9885 1598.5060 1606.4098 2999.8800 2999.9749 3036.2096 3036.6987 3081.2782 3081.7031 3102.0028 3102.1835 3107.6312 3108.0217 3154.1699 3154.2129 3162.5636 3162.7391 3170.9382 3172.4440 3172.5768 3185.9789 3186.0354
redmass: 4.2719 6.8042 3.9507 3.6055 4.4311 3.7687 3.5515 4.2049 5.4519 4.6178 5.1402 1.7289 1.8898 1.6937 1.8548 4.4490 4.0306 3.2487 3.1378 4.4937 4.8904 4.4266 4.1295 3.2619 3.7313 9.1602 8.5157 3.9588 4.0393 5.0419 4.3150 4.0926 3.5904 6.8655 6.3701 5.0425 6.2185 6.0483 5.2263 3.4187 3.3866 1.3595 1.3642 1.5113 1.7014 1.5199 2.0864 2.3324 1.3622 1.3641 2.6004 2.6475 1.3692 1.3689 1.3380 1.3379 3.6780 3.9461 3.5079 3.0882 2.6407 3.7353 1.9440 1.9552 1.9047 1.6872 1.5307 1.4845 1.0993 1.0811 2.1949 1.7695 2.1337 1.3981 1.4929 1.8722 2.9879 1.4852 1.4894 1.4393 1.9668 4.9350 4.6609 1.3208 1.3539 2.6502 2.4097 2.5852 2.6604 1.4166 1.0496 1.8009 1.0462 1.0945 1.1724 1.0784 6.5497 6.9039 7.1156 7.1330 6.9678 1.0363 1.0363 1.0619 1.0620 1.1016 1.1016 1.0998 1.0998 1.1024 1.1024 1.0870 1.0870 1.0903 1.0903 1.0857 1.0957 1.0957 1.1008 1.1008
irintensity: 0.0001 0.9310 0.0069 0.0168 0.0116 0.0462 1.1233 0.0008 0.0069 0.0481 0.0136 0.0345 1.6137 1.3774 0.0532 0.4431 2.3737 0.1789 0.0822 5.4720 5.9957 0.3900 8.6171 0.2402 5.3231 11.0579 0.0297 9.4150 2.0096 1.9271 8.6796 1.9837 3.6583 0.0143 0.5743 1.0308 20.3152 2.0994 1.0834 0.0782 11.4685 1.3412 191.4444 48.7110 41.9548 0.2581 19.1902 0.7079 0.2779 0.0169 1.9954 12.6283 1.8311 0.1258 0.0305 0.0139 7.6619 2.0010 4.9234 2.2675 10.7616 5.5574 12.1149 20.7656 25.0168 3.5726 9.1693 5.1251 0.7009 14.6480 24.6716 101.2218 56.4759 33.7996 34.1338 15.3745 79.2893 9.7659 66.4613 0.1636 114.9774 2.7157 3.6912 9.3596 25.4350 3.9199 4.1446 30.6196 82.6565 2.6304 27.7236 3.8521 2.5238 3.3845 21.4517 33.8206 1074.6054 0.2395 12.3367 2.1231 836.4196 9.7416 7.7722 23.8978 14.5262 0.1456 0.2924 19.6115 24.1955 28.7371 6.2485 1.0551 1.2266 1.7136 1.6995 0.3522 3.4935 4.9240 13.2183 1.6960
temp: 298.150 k
press: 1.00000 atm
elementType: 16 16 7 7 6 6 6 6 6 6 6 6 6 6 6 6 6 6 6 6 6 6 6 1 1 1 1 1 1 1 1 1 1 1 1 1 1 1 1 1 1 1
symmnumber: 1
zpe: 876885.9 jmol-1
zpe.correction: 0.333988 hartree
zpe.thermalcorrener: 0.354991 hartree
zpe.thermalcorrenthalpy: 0.355935 hartree
zpe.thermalcorrgfe: 0.283127 hartree
zpe.sumelectzpe: -1639.220955 hartree
zpe.sumelectthermal: -1639.199953 hartree
zpe.sumelectthermalent: -1639.199008 hartree
zpe.sumelectthermalfe: -1639.271816 hartree
dipole: -0.0012 3.7702 -0.0213
dipole: 3.7702
quadrupole: -53.0246 -108.2518 -154.3691
quadrupole: 0.0077 0.8987 -0.0143
quadrupole: 52.1906 -3.0366 -49.1539 0.0077 0.8987 -0.0143
hfenergy: -1639.5549436 hartree
pointgroup: C01 [X(C19H19N2S2)]
dipole: -0.1090396 1.4557609 0.2629184 debye
polarizability: 550.6992257|14.8852519|255.5214811|37.4476725|28.8499033|119.3413151 unknown
InChI: InChI=1S/C19H19N2S2/c1-3-20-14-9-5-7-11-16(14)22-18(20)13-19-21(4-2)15-10-6-8-12-17(15)23-19/h5-13H,3-4H2,1-2H3
charge 1 multiplicity 1
42 atoms
S  1.591175 -1.572548 -0.089674
S  -1.523216 -1.766949 -0.298285
N  2.296431 0.8901 0.570727
N  -2.590939 0.642699 -0.068675
C  1.162254 0.153567 0.269993
C  -1.356084 0.017297 -0.01081
C  3.525473 0.181729 0.491821
C  -3.701844 -0.214327 -0.29191
C  -0.141853 0.685039 0.241837
C  2.259122 2.338672 0.912263
C  -2.77139 2.106724 0.132708
C  3.352523 -1.185521 0.158131
C  -3.32588 -1.571548 -0.456999
C  4.824606 0.694999 0.708419
C  -5.065277 0.151902 -0.363584
C  4.435997 -2.070773 0.043574
C  -4.266228 -2.584201 -0.704084
C  2.345074 3.244382 -0.332353
C  -2.961244 2.482286 1.615721
C  5.91911 -0.187118 0.594472
C  -6.016945 -0.859135 -0.611008
C  5.73266 -1.554583 0.268377
C  -5.627715 -2.211966 -0.781728
H  -0.221795 1.756464 0.438796
H  1.341773 2.534575 1.492976
H  3.100139 2.533533 1.597975
H  -1.90488 2.627396 -0.308988
H  -3.646029 2.41264 -0.464582
H  4.993577 1.747548 0.951684
H  -5.391155 1.186702 -0.227447
H  4.289383 -3.123959 -0.211911
H  -3.962983 -3.62703 -0.83238
H  1.505133 3.065391 -1.025881
H  3.284134 3.073966 -0.885853
H  2.318932 4.304077 -0.024061
H  -3.852421 1.989998 2.040789
H  -2.088496 2.190204 2.225218
H  -3.097907 3.573763 1.708758
H  6.931089 0.195051 0.75887
H  -7.076171 -0.591063 -0.669163
H  6.598148 -2.21833 0.185809
H  -6.385279 -2.977556 -0.97254
