program: Gaussian 09
title: 000102191
version: EM64L-G09RevD.01
frameworkgroup: C1[X(C6H12O5)]
method: RPBEPBE
basis: SDD
operation: Freq
keyword: #pfreq=noraman
keyword: PBEPBE/SDD
title: #p freq=noraman PBEPBE/SDD
converged: YES YES NO NO
title: Mulliken charges:
elementType: O O O O O C C C C C C H H H H H H H H H H H H
charge: -0.484593 -0.468543 -0.478856 -0.440207 -0.185599 -0.080477 -0.168310 -0.134667 -0.435850 -0.338188 -0.077711 0.239862 0.245086 0.224805 0.238033 0.244596 0.206901 0.224266 0.368997 0.359346 0.376051 0.204880 0.360176
chargesum: 0.00000
title: Mulliken charges with hydrogens summed into heavy atoms:
elementType: O O O O O C C C C C C
charge: -0.115596 -0.109197 -0.102805 -0.080031 -0.185599 0.159385 0.076776 0.090139 0.046779 0.092979 0.127169
polarizability: 9.33937567e+01 -5.25447591e+00 7.97760638e+01 9.19214530e-01 3.47945904e+00 6.99507361e+01
1716.lowfreq: -11.5056 0.0004 0.0009 0.0009 8.6433 10.2727 34.1129 59.2229 74.5057
frequency: 33.5708 59.2157 74.3213 81.1501 124.4004 140.6552 185.4182 228.4239 268.5495 283.0421 300.5966 315.4102 389.6977 442.7575 469.6254 506.3755 515.1172 529.5302 530.4150 621.1043 699.9446 787.3376 834.4577 868.1509 886.4852 938.2081 975.5880 999.0598 1042.0934 1046.1794 1065.3637 1078.0936 1093.3058 1159.4004 1172.5105 1195.3827 1230.6684 1255.3362 1269.3731 1305.3845 1307.3377 1326.1170 1333.8585 1371.2841 1376.5497 1382.3885 1384.8883 1404.0315 1425.7576 1469.5010 1639.9719 2929.3876 2961.0883 2980.3755 2982.4728 2996.3289 3004.4340 3074.1598 3079.7844 3518.4037 3523.7157 3526.0939 3568.2807
redmass: 7.1211 3.3761 3.7000 4.1624 5.1066 4.4332 3.9943 4.7203 4.0548 4.5053 1.2277 2.5683 3.1077 4.0756 2.9379 1.7438 1.3564 1.2159 1.1701 3.7925 4.2141 1.7129 3.7172 3.0752 2.4370 2.5750 3.3125 3.2318 2.2627 2.8146 1.8049 3.0898 2.4045 1.1864 1.3099 1.1908 1.2594 1.2097 1.2262 1.1918 1.3788 1.2358 1.2710 1.4977 1.2707 1.2575 1.4631 1.6226 1.0863 1.0862 7.6299 1.0866 1.0821 1.0716 1.0643 1.0790 1.0848 1.0967 1.0978 1.0648 1.0648 1.0651 1.0664
irintensity: 2.5984 11.3060 6.0592 7.3296 4.8170 8.6407 3.3621 6.1397 6.1361 11.8608 70.3933 1.2178 10.9252 25.2396 67.3464 54.2431 145.1226 146.2936 213.3055 27.9759 21.9905 13.4706 13.8433 32.4353 8.4139 44.0882 80.8467 17.4187 42.8376 116.0966 22.1465 23.5189 16.5393 30.8826 21.1630 54.8363 33.5075 29.4272 9.9732 22.0195 20.6630 32.0968 13.4327 45.8390 7.2285 19.9579 29.7851 3.3065 19.4228 7.0356 171.5232 68.5965 14.5020 16.5088 6.3268 88.9110 40.6273 20.4850 27.4007 28.2365 16.4608 26.2409 12.2738
temp: 298.150 k
press: 1.00000 atm
elementType: 8 8 8 8 8 6 6 6 6 6 6 1 1 1 1 1 1 1 1 1 1 1 1
symmnumber: 1
zpe: 481903.1 jmol-1
zpe.correction: 0.183547 hartree
zpe.thermalcorrener: 0.196461 hartree
zpe.thermalcorrenthalpy: 0.197405 hartree
zpe.thermalcorrgfe: 0.143455 hartree
zpe.sumelectzpe: -611.004581 hartree
zpe.sumelectthermal: -610.991667 hartree
zpe.sumelectthermalent: -610.990723 hartree
zpe.sumelectthermalfe: -611.044673 hartree
dipole: -0.7831 2.6297 1.4206
dipole: 3.0898
quadrupole: -85.6492 -67.1397 -64.6877
quadrupole: 4.8845 4.9036 4.1722
quadrupole: -13.1570 5.3525 7.8045 4.8845 4.9036 4.1722
hfenergy: -611.1881279 hartree
pointgroup: C01 [X(C6H12O5)]
dipole: 0.2628141 -0.8804376 0.7959211 debye
dipolederiv: -0.6216639 0.0349954 -0.0941905 0.0369739 -0.8362627 -0.0574875 -0.0894212 -0.0566068 -0.355472 -0.6291089 0.0607856 0.3014094 0.0348136 -0.533506 0.2270351 0.2764157 0.196048 -0.5361096 -0.7040904 0.2142324 0.1215243 0.2198345 -0.5170365 -0.0455297 0.1600924 -0.047475 -0.606571 -0.6184938 -0.2062926 -0.2201456 -0.243517 -0.4812377 0.0868546 -0.2155811 0.0700199 -0.5421308 -0.7232485 0.2055321 -0.0621045 0.3826244 -0.5888922 0.1656083 -0.1551791 0.1741863 -0.4410799 0.1806894 0.0603338 0.1578035 0.0545912 0.4426923 0.0938993 0.0219226 0.0650119 0.14768 0.4182922 0.0776587 -0.0901153 -0.0359174 0.3295464 -0.1311982 0.0162327 -0.23188 0.5361279 0.4699241 -0.1852039 -0.0421956 -0.1565279 0.3068894 -0.0394957 -0.0848113 0.0633306 0.3212293 -0.5015182 0.2460777 -0.0444609 0.2729512 -0.0508801 0.0684561 0.1168515 -0.0030761 -0.0764956 0.4284854 -0.0046444 0.1377395 0.0874412 0.268893 -0.0732099 0.135155 -0.0780826 0.4379569 1.0759798 -0.4201506 -0.0561418 -0.482418 0.5742436 -0.350439 -0.1843953 -0.2502744 0.4410116 -0.0193601 0.0285396 -0.0930353 0.0520158 0.0035651 -0.0021179 -0.0650261 -0.0247858 -0.1203172 0.0350473 -0.0232707 -0.0023246 -0.0414455 -0.1257926 -0.0440895 -0.0406247 -0.065074 -0.0358173 -0.0740917 0.0419509 -0.1003201 -0.0007883 0.0104314 -0.0070186 -0.1306143 0.0352413 -0.1036276 0.0330845 -0.0285593 0.0409088 -0.0732077 0.0282318 0.0812666 0.0580157 0.0695526 0.0090193 0.1107562 -0.002824 -0.0041282 -0.0879067 0.0111627 -0.0848969 0.0023439 -0.037935 0.0973583 -0.0656799 0.1235387 -0.0043636 0.1191748 0.0298433 -0.0200325 0.0324119 -0.0529438 0.0398881 -0.0301539 -0.0950487 0.0641375 -0.0580155 0.0199172 0.0721529 0.0369022 0.1036858 -0.1361333 0.3002129 -0.117778 0.0735392 -0.0985361 0.3629664 0.0184378 0.1056438 0.0491276 0.2129813 0.2632444 -0.0509834 -0.1736071 -0.0634267 0.2800537 -0.0478135 -0.1314281 -0.028569 0.1502687 0.3467083 -0.0920444 -0.0646534 -0.08339 0.1848254 -0.0088618 -0.0944745 -0.0102465 0.3881027 -0.0071582 -0.0165004 0.0937543 -0.0293202 0.0154811 0.1250713 0.1457269 0.101711 -0.0799626 0.3321433 0.1496556 0.06097 0.1939966 0.264865 -0.0265911 0.0838414 -0.040966 0.2520929 unknown
polarizability: 92.8217204|-6.0750972|78.1042158|0.1660056|-5.4207748|72.1946204 unknown
InChI: InChI=1S/C6H12O5/c7-2-1-4(9)6(11)5(10)3-8/h2,4-6,8-11H,1,3H2
charge 0 multiplicity 1
23 atoms
O  0.606603 -1.895683 -0.219859
O  -1.30059 -0.890876 1.52195
O  2.848853 -0.593264 -0.988177
O  2.957328 1.450792 0.904294
O  -3.538953 1.600162 -0.879481
C  0.777588 -0.528978 0.303619
C  -0.611324 0.075611 0.617673
C  1.628231 0.197168 -0.754613
C  -1.527074 0.226334 -0.610421
C  2.135293 1.57497 -0.301679
C  -2.924237 0.706824 -0.247804
H  1.357871 -0.559195 1.2521
H  -0.486311 1.04843 1.134405
H  1.05387 0.287638 -1.699533
H  -1.094597 0.922148 -1.350423
H  -1.611358 -0.770471 -1.091875
H  1.304287 2.250684 -0.039067
H  2.712965 2.025991 -1.133488
H  -0.038841 -2.355927 0.380051
H  -0.967255 -0.771541 2.447405
H  2.571447 -1.545953 -1.045128
H  -3.385756 0.191047 0.627803
H  3.642862 0.762287 0.693649
