program: Gaussian 09
title: 000102169
version: EM64L-G09RevD.01
frameworkgroup: C1[X(C6H12O5)]
method: RPBEPBE
basis: SDD
operation: Freq
keyword: #pfreq=noraman
keyword: PBEPBE/SDD
title: #p freq=noraman PBEPBE/SDD
converged: YES YES NO NO
title: Mulliken charges:
elementType: O O O O O C C C C C C H H H H H H H H H H H H
charge: -0.220407 -0.469121 -0.454399 -0.313435 -0.445803 -0.152312 -0.178027 -0.071883 -0.061204 -0.332952 -0.495940 0.235916 0.280630 0.211731 0.241587 0.203937 0.248666 0.367474 0.355844 0.363380 0.214706 0.238759 0.232853
chargesum: 0.00000
title: Mulliken charges with hydrogens summed into heavy atoms:
elementType: O O O O O C C C C C C
charge: -0.220407 -0.101647 -0.098556 -0.313435 -0.082423 0.083603 0.102604 0.139848 0.180384 0.119651 0.190378
polarizability: 9.00764141e+01 -1.03545313e+00 8.10478920e+01 2.39617234e+00 1.93383862e+00 6.70741972e+01
1716.lowfreq: -17.4028 -12.6944 -5.1238 0.0003 0.0004 0.0007 80.3021 99.8892 115.8109
frequency: 80.2899 99.8840 115.8072 144.6752 180.5858 194.3272 231.6486 264.5514 298.4725 336.7520 355.4038 396.9620 459.1754 470.7083 501.6730 546.1604 561.4101 584.9620 676.6486 723.6456 801.2393 827.1905 890.4344 904.2223 940.5835 996.4674 1009.6487 1027.2352 1040.1886 1066.0644 1095.1965 1116.9470 1120.4593 1143.3798 1182.4686 1218.7120 1234.2125 1261.0658 1275.2765 1312.8509 1320.0980 1325.0767 1346.4495 1362.4771 1371.9019 1383.4884 1396.8730 1431.5729 1444.8332 1457.3074 1479.3199 2948.5602 2962.6960 2991.3945 3000.1556 3020.4698 3058.8251 3085.5074 3109.0628 3118.9403 3498.4969 3501.4956 3534.5819
redmass: 3.6906 4.3140 2.7762 1.4454 4.3463 3.4415 4.6075 4.7936 3.6426 2.7571 4.3089 5.3464 1.2932 2.7734 1.1612 1.1699 4.6387 4.2401 4.5450 5.8041 4.0138 3.6684 4.3619 2.1265 3.5385 5.2200 5.7315 5.0809 2.3363 4.0626 2.2555 1.2829 2.3959 1.3522 1.2069 1.1567 1.2696 1.2300 1.3505 1.3114 1.1796 1.2943 1.2481 1.3629 1.2832 1.5977 1.6418 1.1402 1.0882 1.0509 1.0523 1.0826 1.0338 1.0770 1.0747 1.0870 1.1006 1.0860 1.0984 1.1019 1.0648 1.0647 1.0654
irintensity: 0.7743 0.9819 7.1105 1.3324 1.5751 8.9134 9.4481 13.2370 8.6589 8.4128 6.0560 9.1031 24.9594 40.9937 109.0901 264.3058 27.2478 28.1754 13.8706 54.0817 9.2910 25.3789 8.3013 4.4906 84.9231 200.8647 122.4206 57.6582 29.2100 32.7215 32.6985 2.0973 44.2833 11.8561 8.3932 41.1300 93.7480 20.5179 1.5928 16.8661 20.4384 4.5503 10.5051 13.2933 25.9324 24.8411 7.8097 6.9175 8.8676 11.4564 11.3517 42.6285 61.7657 8.9009 89.4525 37.4033 39.1548 10.1284 11.6974 20.6421 23.8960 21.7429 21.3446
temp: 298.150 k
press: 1.00000 atm
elementType: 8 8 8 8 8 6 6 6 6 6 6 1 1 1 1 1 1 1 1 1 1 1 1
symmnumber: 1
zpe: 489495.0 jmol-1
zpe.correction: 0.186439 hartree
zpe.thermalcorrener: 0.197971 hartree
zpe.thermalcorrenthalpy: 0.198916 hartree
zpe.thermalcorrgfe: 0.149710 hartree
zpe.sumelectzpe: -611.007678 hartree
zpe.sumelectthermal: -610.996145 hartree
zpe.sumelectthermalent: -610.995201 hartree
zpe.sumelectthermalfe: -611.044407 hartree
dipole: -2.9705 0.4407 -2.0103
dipole: 3.6138
quadrupole: -60.9423 -68.8955 -66.5540
quadrupole: 1.9302 0.7109 3.1823
quadrupole: 4.5216 -3.4316 -1.0901 1.9302 0.7109 3.1823
hfenergy: -611.1941168 hartree
pointgroup: C01 [X(C6H12O5)]
dipole: 1.154554 0.2284681 0.7976718 debye
dipolederiv: -0.7021744 -0.1084196 0.0647625 -0.353301 -0.8350742 0.0828166 0.0366476 0.1469136 -0.4638854 -0.7105479 0.2861244 0.0403668 0.287751 -0.5042025 -0.0728059 0.0834097 -0.0852018 -0.5502594 -0.5075393 -0.0975349 0.18434 -0.128761 -0.8256407 0.0061752 0.1907712 -0.0401214 -0.380076 -1.1376259 -0.0386746 -0.183297 0.0121344 -0.5682885 0.0278175 -0.4120739 -0.1234046 -0.5314403 -0.6511551 -0.1765721 -0.1881082 -0.2108211 -0.4554764 0.0536032 -0.1950671 0.0800831 -0.5693825 0.4154943 -0.2301409 0.0240123 -0.2799259 0.2184154 0.0121406 -0.0328333 0.112251 0.2401388 0.1364885 0.21839 -0.020772 0.1410251 0.4664315 0.007996 -0.0327376 -0.0446099 0.1962719 0.4042519 0.0559004 0.1834555 0.1743603 0.2115041 -0.078379 0.203108 -0.0195784 0.4607576 0.8473151 0.1962947 0.1491061 0.3948901 0.8397662 0.0014361 0.4796963 0.0823485 0.6101223 0.4612095 0.1274679 -0.1235237 0.1341466 0.3004247 -0.0762093 -0.1495039 -0.2389579 0.4138504 0.7241237 -0.0241732 0.0379239 -0.1247351 0.2578982 -0.071569 -0.0305512 -0.0418792 0.2478143 -0.0415016 0.0049422 -0.0888969 -0.0263227 0.0154322 -0.0445537 -0.1025741 -0.0095739 -0.08667 0.0177288 -0.0166917 -0.0749346 0.006689 0.0503102 -0.0030068 -0.0469712 -0.0159481 -0.0172647 -0.0521131 -0.0799755 0.076362 -0.0394645 0.0106384 0.0576973 0.0335601 0.0730822 -0.1876434 -0.0753241 -0.0388943 0.1109371 -0.0590142 0.0116636 0.0229743 0.0318402 0.0352801 -0.1012907 -0.0376718 0.0027981 -0.0712105 -0.0152765 0.0883334 -0.0158794 -0.026881 0.0890511 -0.1422677 0.0658446 -0.0459535 0.0185375 -0.0389874 -0.0885351 -0.0068758 0.0258968 -0.0524628 0.0747591 0.3314073 -0.1213681 -0.0110137 -0.0715776 0.1568295 0.0374807 -0.0495445 0.0466327 0.3556793 0.2733614 -0.0258088 -0.1124006 -0.0163681 0.378756 0.0354944 -0.1214538 0.0105645 0.1940453 0.3022551 0.151628 0.0236371 0.1803223 0.2827531 -0.0230644 0.032701 -0.0272512 0.2807366 -0.0785123 -0.0166009 0.0418299 -0.0259106 0.0418771 0.0925808 0.1699892 0.0857791 -0.0766977 0.0161961 -0.0133882 -0.010261 0.0876119 -0.141717 0.0182696 0.0338104 -0.0054056 0.0933128 -0.0015108 -0.0093493 -0.0708527 -0.028465 0.0879009 -0.0641389 -0.1212388 -0.057591 -0.0606106 unknown
polarizability: 89.9184824|1.4987259|81.2210913|2.5996686|-1.6534928|67.0589295 unknown
InChI: InChI=1S/C6H12O5/c1-10-6-5(9)4(8)3(7)2-11-6/h3-9H,2H2,1H3
charge 0 multiplicity 1
23 atoms
O  0.788763 -1.357369 -0.731652
O  -2.353875 1.149866 0.633572
O  0.085667 2.337492 -0.43469
O  1.8584 0.439561 0.519179
O  -2.283078 -1.302723 -0.602962
C  -1.067183 0.441136 0.636568
C  -0.214626 0.903838 -0.557991
C  -1.389248 -1.061408 0.530013
C  1.06934 0.0612 -0.661899
C  -0.099804 -1.870515 0.340096
C  3.237864 -0.070457 0.48885
H  -0.5111 0.639415 1.575881
H  -0.793929 0.793022 -1.488757
H  -1.872254 -1.39345 1.47537
H  1.638713 0.274638 -1.58674
H  0.458908 -1.895887 1.296625
H  -0.344696 -2.895176 0.021868
H  -2.162498 2.104963 0.439619
H  0.843449 2.408741 0.207178
H  -2.975081 -0.588553 -0.560237
H  3.791819 0.347295 -0.375757
H  3.244941 -1.1740 0.429019
H  3.706309 0.261472 1.427949
