program: Gaussian 09
title: 000102281
version: EM64L-G09RevD.01
frameworkgroup: C1[X(C22H34O2)]
method: RPBEPBE
basis: SDD
operation: Freq
keyword: #pfreq=noraman
keyword: PBEPBE/SDD
title: #p freq=noraman PBEPBE/SDD
converged: YES YES NO NO
title: Mulliken charges:
elementType: O O C C C C C C C C C C C C C C C C C C C C C C H H H H H H H H H H H H H H H H H H H H H H H H H H H H H H H H H H
charge: -0.420573 -0.240300 -0.453373 -0.462785 -0.453265 -0.467621 -0.178847 -0.154253 -0.466530 -0.478241 -0.158848 -0.160210 -0.552143 -0.471185 -0.163543 -0.184920 -0.155831 -0.154412 -0.471269 -0.103056 -0.210003 -0.393762 0.221295 -0.715082 0.203831 0.218347 0.205435 0.204184 0.217223 0.201349 0.204323 0.203834 0.215498 0.213671 0.205373 0.199216 0.202653 0.201079 0.230779 0.217197 0.203485 0.203274 0.237249 0.210001 0.233106 0.213519 0.215064 0.225031 0.244278 0.249862 0.218688 0.202704 0.202692 0.206857 0.240074 0.207211 0.217650 0.374019
chargesum: 0.00000
title: Mulliken charges with hydrogens summed into heavy atoms:
elementType: O O C C C C C C C C C C C C C C C C C C C C C C
charge: -0.046554 -0.240300 -0.031194 -0.053167 -0.034693 -0.059464 0.036651 0.059418 -0.061941 -0.074509 0.058349 0.070569 -0.145385 -0.023935 0.069564 0.028599 0.059233 0.070619 0.022871 0.115632 -0.007299 0.015788 0.221295 -0.050147
polarizability: 2.56275603e+02 -2.73220604e+01 2.56859773e+02 1.78098696e+01 -4.44066986e+00 2.25344560e+02
1716.lowfreq: -7.7130 -4.3020 -0.0003 0.0005 0.0006 5.5600 16.8908 18.4050 23.0569
frequency: 16.3282 18.4040 22.9794 24.2411 30.5215 31.4036 38.3693 41.4750 49.7406 54.9865 59.1093 72.3586 97.6170 98.2040 115.7742 124.1381 145.2064 150.9033 176.5272 181.6545 189.0150 206.4527 218.6642 221.6832 262.5843 267.7777 290.8047 294.4246 323.4050 334.4701 353.6311 356.5277 362.5925 378.0644 442.5167 460.8619 472.7139 476.7459 505.1400 509.7715 512.7881 533.1482 561.4388 597.0599 665.8585 713.9482 754.0104 771.2692 778.7557 791.5495 806.0689 813.1859 818.2251 828.0995 838.8778 872.9935 877.3677 896.0546 916.5086 926.3122 931.5200 954.8609 963.3547 968.7638 971.9858 975.1430 976.0311 984.4804 988.6982 998.9589 1000.0223 1010.6810 1017.7043 1042.0863 1053.8177 1055.7720 1075.6363 1081.6841 1092.0225 1096.7945 1101.3614 1104.8456 1113.8004 1133.7925 1148.4322 1167.6420 1182.6967 1195.4581 1196.9067 1197.2641 1204.6627 1213.5411 1235.9250 1250.8085 1251.7014 1255.7414 1260.6553 1272.0980 1280.1732 1287.4562 1288.1018 1290.2155 1294.2030 1297.8426 1299.3463 1302.3731 1306.5756 1320.8569 1326.2719 1335.4111 1336.5717 1341.1422 1344.6206 1347.9577 1358.8550 1393.0799 1444.4352 1454.6616 1455.1068 1456.4846 1456.7314 1457.7855 1458.5756 1459.9758 1461.1931 1468.7566 1482.7748 1493.5666 1667.7428 1674.0314 1683.7037 1687.0673 1687.5067 1689.9088 2948.6490 2948.8994 2953.9828 2956.3566 2961.6998 2963.8728 2964.7448 2968.1846 2974.4622 2984.5945 2984.6503 2996.6943 3010.1249 3015.6392 3017.2324 3021.0377 3026.0661 3030.2472 3039.5961 3050.8628 3057.9750 3064.0775 3065.2446 3065.8325 3066.7338 3067.4863 3068.9135 3075.0047 3075.2446 3080.0216 3080.5865 3083.9367 3086.0346 3504.7738
redmass: 4.9348 4.9211 4.6512 4.4738 4.7762 4.3254 6.5995 3.2089 3.4870 3.9333 2.9983 3.3910 2.3738 2.5254 3.3343 2.4978 2.3191 2.9195 1.9017 2.1584 2.1292 2.6072 2.4069 2.1305 2.5861 2.3763 1.4126 3.4548 2.7304 3.0627 2.1602 2.6266 2.3674 2.6379 2.5705 3.1996 2.2826 2.6487 2.3743 2.3568 2.6820 2.3221 2.7252 2.4114 1.5594 1.2908 1.2428 2.3297 1.5800 1.7722 1.6183 1.7627 1.8509 1.6786 1.7466 2.1230 2.4019 1.9260 2.0849 1.9812 2.1287 1.6469 1.2743 1.1605 1.5266 1.1207 1.2145 1.3882 2.3557 2.6823 2.0565 2.9841 1.9559 1.5437 2.1708 1.9776 1.7945 1.5514 2.4951 2.6146 2.5849 2.8501 1.7328 1.8071 1.9330 1.5788 1.4194 1.2542 1.1868 1.1694 1.3182 1.3243 1.2706 1.2697 1.1921 1.4860 1.1641 1.2665 1.2599 1.2626 1.2707 1.2634 1.2334 1.2787 1.2363 1.2317 1.2983 1.3468 1.4202 1.3813 1.4821 1.4260 1.4835 1.4699 1.6987 1.2241 1.0956 1.0920 1.0929 1.0911 1.0921 1.0962 1.0857 1.1003 1.1014 1.1009 1.0419 1.0513 8.2739 6.8561 6.5624 6.4261 6.5825 6.1721 1.0604 1.0605 1.0609 1.0609 1.0642 1.0601 1.0593 1.0613 1.0365 1.0704 1.0890 1.0642 1.0993 1.0989 1.0938 1.1001 1.0980 1.0976 1.0992 1.0956 1.0944 1.0914 1.0927 1.0920 1.0954 1.0982 1.0899 1.0966 1.0976 1.0903 1.0893 1.0893 1.0886 1.0638
irintensity: 0.0992 0.3197 0.0062 0.1259 0.1649 0.2348 1.6022 0.0439 0.4349 0.0074 0.2281 0.1261 0.3671 0.5318 0.7408 0.2195 0.2944 0.8062 0.0925 0.9553 0.1399 0.6444 0.1398 1.7227 1.2953 2.6873 2.4536 0.2017 0.3063 2.3973 0.9727 3.1675 0.5153 2.6932 1.3771 19.4163 0.5412 2.0432 3.1835 0.7820 38.0821 1.0298 1.5337 29.7547 148.8432 4.1207 4.6239 2.2040 2.1018 1.2694 8.3965 0.7203 0.5513 3.0128 1.5075 5.3066 3.9048 8.3543 0.4200 2.4385 16.5800 14.2698 23.4832 43.3456 17.6002 60.4210 82.7794 26.0864 8.0082 31.3568 36.2865 22.0107 9.1281 4.0106 41.6263 81.7733 25.7423 1.6624 7.6953 15.0057 3.3613 10.0453 3.0597 14.2748 1.2178 3.7359 0.6202 0.4031 0.8848 0.2315 1.2013 0.8238 0.1989 0.7275 0.5455 5.1311 1.2746 0.4857 0.7034 2.0860 0.4722 0.2893 0.4698 0.6283 0.6476 3.5323 1.6504 3.4898 1.4979 0.7512 0.5566 3.0843 0.6281 1.0638 35.0036 10.9471 23.4455 9.2194 8.9552 40.5696 4.8261 6.3398 10.1510 3.5231 10.1564 12.1486 11.8458 6.9946 180.7236 0.8994 0.4829 0.3035 0.6216 0.5018 47.8595 24.3982 23.4063 10.8174 53.4692 61.2028 67.2777 86.2399 19.6987 20.0607 26.5959 39.0588 16.4298 17.5098 5.5568 19.4717 41.6896 23.6093 30.4426 5.1850 1.2097 8.7643 37.7976 4.2185 3.6536 92.8310 56.3702 11.4099 17.3273 143.2959 6.7622 43.6019 38.3053 16.9040
temp: 298.150 k
press: 1.00000 atm
elementType: 8 8 6 6 6 6 6 6 6 6 6 6 6 6 6 6 6 6 6 6 6 6 6 6 1 1 1 1 1 1 1 1 1 1 1 1 1 1 1 1 1 1 1 1 1 1 1 1 1 1 1 1 1 1 1 1 1 1
symmnumber: 1
zpe: 1316664.9 jmol-1
zpe.correction: 0.501491 hartree
zpe.thermalcorrener: 0.530864 hartree
zpe.thermalcorrenthalpy: 0.531808 hartree
zpe.thermalcorrgfe: 0.435258 hartree
zpe.sumelectzpe: -1007.223037 hartree
zpe.sumelectthermal: -1007.193664 hartree
zpe.sumelectthermalent: -1007.192719 hartree
zpe.sumelectthermalfe: -1007.289270 hartree
dipole: 0.1965 1.0900 0.5018
dipole: 1.2159
quadrupole: -147.5441 -148.6117 -141.6631
quadrupole: -9.6574 0.7284 -1.2411
quadrupole: -1.6045 -2.6721 4.2765 -9.6574 0.7284 -1.2411
hfenergy: -1007.7245278 hartree
pointgroup: C01 [X(C22H34O2)]
dipole: -0.0677349 0.4538215 -0.1353195 debye
polarizability: 258.3098037|24.6772153|253.7546196|21.0827655|7.5785349|226.4155119 unknown
InChI: InChI=1S/C22H34O2/c1-2-3-4-5-6-7-8-9-10-11-12-13-14-15-16-17-18-19-20-21-22(23)24/h3-4,7-8,10-11,14-15,18-19,23H,2,5-6,9,12-13,16-17,20-21H2,1H3
charge 0 multiplicity 1
58 atoms
O  4.329247 -0.199572 -1.96995
O  4.720442 -2.121144 -0.730188
C  -0.082986 -2.849255 0.037416
C  -3.866455 -2.71511 -1.162934
C  0.318284 -2.111697 1.35367
C  -4.630725 -1.354086 -1.256053
C  -1.580118 -3.04637 -0.071516
C  -2.365276 -2.546965 -1.061101
C  -0.155242 2.969673 2.049463
C  0.658348 3.571549 0.857978
C  -4.529184 -0.526391 0.007906
C  1.816245 -1.946857 1.488929
C  -3.789456 1.503931 1.377277
C  3.966276 -0.590647 1.695898
C  -3.947496 0.698101 0.09589
C  2.462601 -0.756993 1.602042
C  -1.632166 2.828274 1.748286
C  -2.3205 1.657339 1.742955
C  4.563907 0.066918 0.42111
C  0.672872 2.679787 -0.367082
C  0.272345 3.057311 -1.608825
C  0.255669 2.195681 -2.859154
C  4.547311 -0.883438 -0.761618
C  0.719686 0.736642 -2.672878
H  0.43585 -3.830818 0.017875
H  0.290978 -2.273508 -0.830825
H  -4.115713 -3.305016 -2.070223
H  -4.240861 -3.292023 -0.294434
H  -0.181766 -1.124492 1.381654
H  -0.07584 -2.696434 2.211841
H  -4.238131 -0.774482 -2.114774
H  -5.695745 -1.575131 -1.476948
H  -2.052558 -3.624935 0.740047
H  -1.892918 -1.956502 -1.864365
H  -0.010691 3.629784 2.930229
H  0.265577 1.98041 2.319693
H  0.244954 4.565395 0.594923
H  1.697439 3.743587 1.211766
H  2.414099 -2.872562 1.46877
H  -4.946803 -0.982948 0.920648
H  -4.33704 0.995067 2.195842
H  -4.239782 2.50961 1.255494
H  4.449072 -1.572879 1.848173
H  4.225538 0.047363 2.563525
H  -3.504792 1.149554 -0.805719
H  1.869395 0.172577 1.606946
H  -2.165431 3.759325 1.494003
H  -1.789646 0.719842 1.972455
H  5.622245 0.343884 0.602241
H  4.028865 0.992484 0.147871
H  1.026513 1.649822 -0.205395
H  -0.088948 4.090235 -1.746228
H  -0.775337 2.204718 -3.273588
H  0.883352 2.685077 -3.634529
H  1.768291 0.688713 -2.326455
H  0.650224 0.183266 -3.627634
H  0.090171 0.212405 -1.929151
H  4.351911 -0.852868 -2.72205
