program: Gaussian 09
title: 000102235
version: EM64L-G09RevD.01
frameworkgroup: C1[X(C17H23NO2)]
method: RPBEPBE
basis: SDD
operation: Freq
keyword: #p
keyword: freq=noraman
keyword: PBEPBE/SDD
title: #p freq=noraman PBEPBE/SDD
converged: NO YES NO NO
title: Mulliken charges:
elementType: O O N C C C C C C C C C C C C C C C C C H H H H H H H H H H H H H H H H H H H H H H H
charge: -0.272496 -0.252385 -0.062638 -0.150400 -0.138286 -0.486126 -0.483444 -0.462039 -0.491125 0.019070 -0.645761 0.280776 -0.667489 0.452413 -0.365969 -0.408154 -0.374573 -0.390645 0.433750 -0.806649 0.232723 0.233343 0.224247 0.232892 0.231508 0.215591 0.230923 0.228131 0.232731 0.207961 0.248122 0.228735 0.227321 0.195226 0.239388 0.236175 0.255845 0.231568 0.228241 0.228261 0.225049 0.223544 0.234643
chargesum: 0.00000
title: Mulliken charges with hydrogens summed into heavy atoms:
elementType: O O N C C C C C C C C C C C C C C C C C
charge: -0.272496 -0.252385 -0.062638 0.082322 0.095057 -0.028987 -0.036345 -0.002984 -0.050433 0.267192 0.005522 0.280776 -0.191926 0.452413 -0.110124 -0.176586 -0.146332 -0.162384 0.433750 -0.123413
polarizability: 2.23248481e+02 -2.17330799e+01 1.70161219e+02 -9.24959688e+00 -3.98469583e+00 1.72564943e+02
1716.lowfreq: -16.8706 -14.5947 -8.2190 -4.4662 0.0003 0.0007 0.0009 13.9256 21.0224
frequency: -14.0055 11.0678 20.0565 35.7584 45.6305 62.4316 87.3436 138.6258 158.5122 171.4235 199.9293 209.2826 240.1573 268.9694 278.6544 317.7629 325.6127 361.4208 362.1047 371.3233 405.7468 432.8932 452.5219 453.6383 493.5988 504.7115 568.0910 613.3260 638.0433 683.3058 697.4754 714.8039 738.4070 764.2977 770.5896 776.4306 809.0651 818.2474 837.4158 841.3272 850.2043 866.9247 869.5449 919.0723 932.8575 949.5256 961.3299 961.5520 974.2855 980.3781 981.2576 989.0401 1014.4391 1032.4400 1043.3891 1047.3953 1070.9622 1097.3057 1103.3129 1113.1640 1126.5970 1127.7547 1148.2148 1156.6435 1192.5123 1196.0532 1203.3141 1204.6547 1222.9329 1224.0141 1229.6645 1242.1312 1255.2802 1271.8240 1284.8569 1288.0180 1291.9158 1309.0263 1313.0274 1318.2390 1341.8636 1353.0721 1363.2186 1377.6481 1396.4632 1407.8699 1424.5288 1449.4046 1453.5531 1461.5750 1463.7979 1466.3839 1472.2049 1473.7080 1482.5709 1486.5914 1507.8420 1586.1130 1620.2115 1629.8829 2882.1500 2973.9437 3001.5070 3003.6553 3010.2819 3014.4655 3017.3935 3022.3468 3023.0873 3041.1447 3051.2888 3054.8090 3054.8859 3072.8386 3076.6675 3077.9773 3082.1169 3083.4060 3096.1532 3115.2145 3118.2382 3138.5370 3146.2608
redmass: 4.0990 3.4572 4.2307 1.0176 4.3907 5.8814 4.7175 4.6746 3.2196 2.1602 1.0491 3.7415 4.6149 2.8777 2.2453 3.3574 3.9609 2.8417 2.5921 2.3642 2.8382 3.6046 3.0120 2.7686 3.3796 3.1091 3.0102 4.4328 6.5702 5.1411 4.8018 3.4249 4.4673 2.8299 3.1316 1.9059 2.2850 2.6064 2.6943 2.7291 1.2551 1.6322 3.0891 3.1032 2.2443 1.9972 2.0346 2.1414 1.3843 1.8297 2.3603 1.4416 2.9823 1.9542 1.6351 1.5602 2.0210 1.7728 1.5910 1.3083 1.6689 1.5641 1.3067 2.0433 1.1460 1.4877 1.5584 2.8508 2.8154 1.4406 1.6720 1.5961 1.2706 1.3836 1.5209 1.4583 1.5468 1.3586 1.3190 1.3270 1.5586 1.5234 1.4171 5.1630 1.2269 2.6991 1.1693 1.0885 1.0967 1.0724 1.0786 1.0726 1.0701 1.0781 1.0520 1.0872 2.6400 6.1576 7.3560 8.3253 1.0534 1.0385 1.0589 1.0610 1.0604 1.0629 1.0613 1.0837 1.0767 1.0881 1.0891 1.0952 1.1024 1.1026 1.1043 1.1005 1.1034 1.0997 1.1007 1.0873 1.0880 1.0963 1.0970
irintensity: 0.2122 0.1789 0.5452 0.5301 0.3992 1.4936 2.4761 1.6156 0.7081 0.2668 0.0877 5.1332 4.2808 0.3174 0.0848 2.6731 2.0761 1.0443 4.3663 1.4415 0.0653 12.6848 0.2396 2.0131 2.0206 23.2316 9.8830 10.2470 0.7324 11.2478 0.5820 0.5495 0.9673 22.0629 6.9485 0.9283 33.3367 1.6409 0.6996 19.4343 1.2479 0.3907 5.0606 3.9441 4.3322 59.1187 29.0574 27.8750 0.4013 1.9769 17.7433 8.4860 6.7476 47.9255 27.1857 19.0740 23.9220 179.3763 11.3809 2.7511 10.6979 86.1750 2.5756 0.3708 6.0882 0.9501 19.0381 0.2508 1.8690 10.5288 185.7377 8.1305 3.4307 1.2803 58.9595 7.9199 10.6683 3.8808 1.2317 18.7169 9.6132 1.5950 2.4632 3.3250 10.5543 3.3342 4.1687 6.5521 14.5446 9.1086 13.1492 12.1916 13.7046 13.3347 3.7095 23.4383 41.8960 1.7309 61.1094 89.9913 112.5394 39.7733 16.1928 28.8425 11.2227 45.5130 15.5393 10.7626 50.1222 67.9224 8.9033 22.5834 9.4551 14.9700 48.5548 34.3784 49.3654 19.0576 6.7482 10.4113 20.8631 30.4647 1.3216
temp: 298.150 k
press: 1.00000 atm
elementType: 8 8 7 6 6 6 6 6 6 6 6 6 6 6 6 6 6 6 6 6 1 1 1 1 1 1 1 1 1 1 1 1 1 1 1 1 1 1 1 1 1 1 1
symmnumber: 1
zpe: 959536.2 jmol-1
zpe.correction: 0.365468 hartree
zpe.thermalcorrener: 0.383875 hartree
zpe.thermalcorrenthalpy: 0.384819 hartree
zpe.thermalcorrgfe: 0.316029 hartree
zpe.sumelectzpe: -865.296192 hartree
zpe.sumelectthermal: -865.277785 hartree
zpe.sumelectthermalent: -865.276841 hartree
zpe.sumelectthermalfe: -865.345631 hartree
dipole: 1.2695 1.0253 -0.6093
dipole: 1.7419
quadrupole: -101.4853 -117.6199 -119.6049
quadrupole: -3.6904 0.8753 5.0637
quadrupole: 11.4180 -4.7165 -6.7015 -3.6904 0.8753 5.0637
hfenergy: -865.6616603 hartree
pointgroup: C01 [X(C17H23N1O2)]
dipole: -0.4985836 -0.3493738 -0.3146237 debye
polarizability: 223.4516174|-22.9147011|168.5097718|4.6248547|3.2539848|174.0132535 unknown
InChI: InChI=1S/C17H23NO2/c1-12-3-5-13(6-4-12)9-17(19)20-16-10-14-7-8-15(11-16)18(14)2/h3-6,14-16H,7-11H2,1-2H3
charge 0 multiplicity 1
43 atoms
O  -0.494445 1.362025 -0.424493
O  0.285244 1.667971 1.757013
N  -3.825316 -1.094347 -0.741321
C  -3.097311 -1.289831 0.555361
C  -4.163437 0.364962 -0.671876
C  -3.957068 -0.521111 1.628382
C  -4.6798 0.594846 0.798513
C  -1.684668 -0.671795 0.39017
C  -2.862933 1.15703 -0.965278
C  -1.80303 0.83978 0.102339
C  -5.00361 -1.97709 -0.907539
C  0.467872 1.720848 0.516982
C  1.759271 2.15958 -0.166796
C  2.817915 1.05554 -0.124028
C  3.360621 0.620613 1.111887
C  3.27428 0.443291 -1.315761
C  4.339931 -0.394185 1.147707
C  4.256919 -0.572034 -1.27501
C  4.810878 -1.005239 -0.044201
C  5.89158 -2.072355 -0.00069
H  -3.006017 -2.366943 0.778483
H  -4.925381 0.61284 -1.431088
H  -3.326554 -0.106423 2.434847
H  -4.688186 -1.200989 2.100472
H  -5.776838 0.476813 0.846427
H  -4.443534 1.610862 1.162593
H  -1.075828 -0.835379 1.297718
H  -1.187334 -1.165374 -0.463954
H  -2.484422 0.85109 -1.956562
H  -3.063547 2.244452 -0.989914
H  -2.005961 1.383893 1.043417
H  -4.664322 -3.027945 -0.935852
H  -5.488117 -1.754025 -1.874883
H  -5.777424 -1.888095 -0.107071
H  2.124651 3.051789 0.373797
H  1.539044 2.441499 -1.208449
H  3.000354 1.070174 2.044607
H  2.856467 0.757116 -2.280012
H  4.746127 -0.718216 2.114069
H  4.59591 -1.033802 -2.21063
H  5.806861 -2.697385 0.906144
H  5.840462 -2.737894 -0.880361
H  6.901095 -1.616656 0.009242
