program: Gaussian 09
title: 000100154
version: EM64L-G09RevD.01
frameworkgroup: C1[X(C18H22O6)]
method: RPBEPBE
basis: SDD
operation: Freq
keyword: #pfreq=noraman
keyword: PBEPBE/SDD
title: #p freq=noraman PBEPBE/SDD
converged: YES YES NO NO
title: Mulliken charges:
elementType: O O O O O O C C C C C C C C C C C C C C C C C C H H H H H H H H H H H H H H H H H H H H H H
charge: -0.463982 -0.285038 -0.293468 -0.298490 -0.324920 -0.438955 -0.208967 -0.636304 0.530333 0.542592 -0.563453 -0.573961 0.277207 0.269737 -0.486359 -0.454143 0.022535 0.137152 -0.321783 0.195038 -0.547016 -0.526232 -0.519442 -0.523755 0.216680 0.243604 0.200250 0.300863 0.261099 0.282829 0.228977 0.335866 0.238370 0.238798 0.260104 0.212421 0.264814 0.223610 0.209022 0.378226 0.255912 0.218420 0.223967 0.228149 0.225076 0.244619
chargesum: 0.00000
title: Mulliken charges with hydrogens summed into heavy atoms:
elementType: O O O O O O C C C C C C C C C C C C C C C C C C
charge: -0.128116 -0.285038 -0.293468 -0.298490 -0.324920 -0.060730 0.007713 -0.192450 0.530333 0.542592 -0.262590 -0.312862 0.277207 0.269737 -0.203531 -0.225166 0.022535 0.137152 -0.083413 0.195038 0.164308 0.171214 0.178856 0.174090
polarizability: 2.82022934e+02 -1.20223446e+01 2.40520237e+02 -3.35231961e+01 -5.38555401e+00 1.46809841e+02
1716.lowfreq: -5.9950 -0.0005 -0.0004 0.0004 7.1443 10.7426 14.0006 20.4981 38.0092
frequency: 13.3360 20.2185 37.9563 57.0017 59.5042 72.7834 85.1057 89.6532 99.9643 110.9569 143.4903 144.3926 164.0552 173.0395 175.5442 196.1023 201.5801 221.5793 229.1600 237.4083 255.1665 269.6450 281.5924 284.2031 295.9937 298.0480 335.1391 348.2996 370.5947 376.9180 407.4485 446.9948 457.5215 485.8451 494.3130 502.6404 505.0607 529.5422 558.8443 582.2298 605.2096 616.1354 653.3532 665.3723 711.2440 715.8687 730.5091 745.4332 760.0442 791.9631 846.5254 861.5562 868.8569 886.6826 901.7871 912.6100 933.1633 947.5565 955.1287 987.7028 994.5312 1012.6102 1017.0913 1064.5050 1108.8539 1110.1789 1112.6625 1114.6464 1117.1102 1117.9858 1145.1976 1152.3733 1154.8907 1156.8520 1158.7754 1161.7726 1176.6480 1193.3821 1202.7551 1222.2399 1226.1097 1263.2716 1276.7303 1293.9316 1301.1842 1303.9393 1371.3359 1383.0550 1399.5442 1410.0787 1422.5849 1436.5140 1437.6860 1445.4774 1454.7296 1456.8792 1458.1623 1460.0049 1465.8917 1467.8705 1471.3361 1476.5618 1482.7036 1483.5511 1487.8531 1497.4677 1581.9326 1594.7792 1605.6113 1629.0382 2942.8669 2961.5288 2966.4333 2968.1430 2970.1353 2976.2281 3055.0888 3056.0489 3056.1399 3074.8827 3080.2625 3119.5934 3120.1950 3121.2293 3125.2719 3128.5071 3158.2034 3162.2005 3163.3548 3189.2642 3509.9128 3562.3781
redmass: 5.1507 4.6017 5.5197 4.2415 3.5509 3.3004 2.8779 3.3045 3.3053 4.2166 1.9322 3.1189 1.7440 1.4434 2.6727 3.2135 2.3312 1.8901 1.2951 4.6165 2.5031 2.7232 1.9527 2.2774 3.6501 3.5874 4.6950 3.7700 4.5082 4.2711 4.7679 3.8705 4.0060 5.5740 5.4081 1.4961 2.3484 4.7733 5.6214 4.8256 4.8360 4.8651 3.4798 4.4378 4.2196 4.3992 4.8058 4.7797 4.1858 1.4686 1.5449 3.5561 3.5703 1.7132 1.4924 1.3537 3.2499 4.0489 6.7138 6.5001 8.1047 3.3635 3.9167 6.5144 1.9167 1.2705 1.2394 1.6492 1.2604 1.6384 1.6009 1.3688 1.3738 1.3115 1.3968 1.3000 1.7583 1.4393 1.4733 1.9856 1.5407 2.7052 1.2313 2.9602 1.3864 1.6509 5.1448 2.6049 3.3174 1.8635 1.2593 1.3538 1.2281 1.3287 1.1285 1.1129 1.1187 2.2765 1.0513 1.0614 1.4653 1.1412 1.0628 1.6000 1.0995 2.7984 7.6811 7.4461 6.5882 6.6041 1.0844 1.0328 1.0326 1.0347 1.0642 1.0316 1.1035 1.1038 1.0983 1.0976 1.1016 1.1005 1.1037 1.1043 1.0892 1.0996 1.0939 1.0905 1.0931 1.0917 1.0645 1.0659
irintensity: 0.0859 0.7073 1.3589 1.6985 0.2078 9.3214 7.6809 1.8580 3.8354 4.9450 0.2817 1.4366 0.4071 3.6801 4.0785 0.9135 2.0129 1.0140 0.3815 1.4800 36.0225 1.7055 27.3721 58.3837 16.2341 26.4823 3.0384 4.2329 1.3324 7.4870 4.2026 12.0309 4.2851 3.7221 6.5445 93.4889 48.2262 7.8267 22.7416 3.7965 3.2811 10.2358 17.5575 15.9953 6.4539 6.2741 13.9463 11.1041 11.2169 33.7718 34.3412 12.1134 13.3049 18.1548 44.2003 0.9797 3.1236 42.0702 36.1356 71.8334 44.8400 75.2848 11.9986 255.1403 36.7290 8.9762 9.5803 40.9852 0.5709 34.1107 0.7873 3.0985 7.7825 40.2271 15.3070 31.6873 65.1616 85.9713 53.2661 104.5962 30.8145 105.8755 13.2021 79.6197 19.5984 22.6959 36.3705 68.7679 36.0149 43.7972 5.9554 24.0177 17.3830 19.7127 10.0377 16.3440 4.1832 6.8494 14.4547 13.6175 64.1329 53.1458 19.5507 17.8649 35.1070 137.3889 97.2411 29.4188 23.8461 2.6026 35.1010 53.5615 72.1924 90.7753 56.1664 79.0095 29.0938 39.4280 24.3439 35.5471 29.7924 19.2677 25.1263 22.4812 20.4108 12.3078 18.6518 7.0372 0.0994 0.9660 76.1495 7.8488
temp: 298.150 k
press: 1.00000 atm
elementType: 8 8 8 8 8 8 6 6 6 6 6 6 6 6 6 6 6 6 6 6 6 6 6 6 1 1 1 1 1 1 1 1 1 1 1 1 1 1 1 1 1 1 1 1 1 1
symmnumber: 1
zpe: 961344.9 jmol-1
zpe.correction: 0.366157 hartree
zpe.thermalcorrener: 0.391583 hartree
zpe.thermalcorrenthalpy: 0.392528 hartree
zpe.thermalcorrgfe: 0.309504 hartree
zpe.sumelectzpe: -1148.571245 hartree
zpe.sumelectthermal: -1148.545819 hartree
zpe.sumelectthermalent: -1148.544875 hartree
zpe.sumelectthermalfe: -1148.627898 hartree
dipole: 7.0592 -0.9893 -2.0403
dipole: 7.4145
quadrupole: -116.3071 -130.3047 -140.5899
quadrupole: 5.1919 -12.1862 5.0955
quadrupole: 12.7602 -1.2375 -11.5227 5.1919 -12.1862 5.0955
hfenergy: -1148.9374022 hartree
pointgroup: C01 [X(C18H22O6)]
dipole: -2.3880865 0.5558249 -1.5803256 debye
polarizability: 253.3049961|-3.5157533|239.7047205|62.3201187|-22.6240258|176.3432962 unknown
InChI: InChI=1S/C18H22O6/c1-21-15-6-5-11(8-14(15)20)7-13(19)12-9-16(22-2)18(24-4)17(10-12)23-3/h5-6,8-10,13,19-20H,7H2,1-4H3
charge 0 multiplicity 1
46 atoms
O  0.532031 -3.891517 -0.011166
O  2.045205 1.984567 -0.915247
O  4.130062 -1.281355 2.049037
O  4.086323 1.326549 0.871297
O  -4.42473 2.182238 -1.253967
O  -2.50155 2.515881 0.574946
C  -0.02649 -2.561918 -0.313702
C  -1.322811 -2.330774 0.545144
C  1.072573 -1.545431 -0.029493
C  -2.177598 -1.165912 0.072975
C  2.091404 -1.835884 0.90019
C  1.042322 -0.280148 -0.665576
C  2.022423 0.691108 -0.360816
C  3.094976 -0.880762 1.181518
C  -1.971048 0.144509 0.578515
C  -3.181088 -1.368624 -0.906935
C  3.083629 0.390664 0.545004
C  -2.734659 1.219887 0.096242
C  -3.968457 -0.293932 -1.388637
C  -3.741765 1.00088 -0.886668
C  0.859065 2.417124 -1.662539
C  4.37899 -0.426552 3.229543
C  4.930986 1.781516 -0.254753
C  -5.507532 2.061154 -2.230751
H  -0.314747 -2.509276 -1.386564
H  -1.013633 -2.205469 1.598381
H  -1.925676 -3.260767 0.48565
H  2.140711 -2.815096 1.380511
H  0.247147 -0.053525 -1.380968
H  -1.204038 0.343012 1.333129
H  -3.361614 -2.377773 -1.295907
H  -0.181061 -4.57062 -0.117692
H  -4.742983 -0.478579 -2.139503
H  1.050433 3.471481 -1.912678
H  -0.052024 2.337744 -1.039948
H  0.73218 1.832934 -2.594958
H  4.626265 0.603681 2.924628
H  5.229621 -0.895639 3.74791
H  3.491307 -0.425339 3.892491
H  -3.161406 3.127922 0.151908
H  4.321256 2.314726 -1.003343
H  5.44618 0.919541 -0.71975
H  5.669112 2.462731 0.196278
H  -6.307317 1.395332 -1.853851
H  -5.127462 1.678797 -3.197545
H  -5.900813 3.079813 -2.361638
