program: Gaussian 09
title: 000102210
version: EM64L-G09RevD.01
frameworkgroup: C1[X(C20H28O3)]
method: RPBEPBE
basis: SDD
operation: Freq
keyword: #pfreq=noraman
keyword: PBEPBE/SDD
title: #p freq=noraman PBEPBE/SDD
converged: NO YES NO NO
title: Mulliken charges:
elementType: O O O C C C C C C C C C C C C C C C C C C C C H H H H H H H H H H H H H H H H H H H H H H H H H H H H
charge: -0.451747 -0.217596 -0.235774 0.351265 -0.092157 -0.145673 -0.075390 0.138066 -0.546463 -0.565481 -0.519548 -0.497099 -0.241900 -0.491972 -0.839311 -0.639614 0.536659 -0.465196 0.123322 -0.543424 -0.577976 -0.766264 0.179254 0.246231 0.226661 0.224520 0.176200 0.257457 0.220259 0.232528 0.214163 0.225124 0.221240 0.240689 0.231969 0.224502 0.222670 0.221081 0.224055 0.262602 0.218401 0.238002 0.214598 0.223104 0.343604 0.243529 0.225298 0.256901 0.233950 0.263270 0.251410
chargesum: 0.00000
title: Mulliken charges with hydrogens summed into heavy atoms:
elementType: O O O C C C C C C C C C C C C C C C C C C C C
charge: -0.108143 -0.217596 -0.235774 0.351265 0.154074 0.080988 0.149129 0.138066 -0.112806 -0.112694 -0.080260 -0.035169 -0.009931 -0.044801 -0.131573 -0.183211 0.536659 -0.027494 0.123322 -0.074596 -0.321075 -0.017634 0.179254
polarizability: 2.91017727e+02 -9.47635514e+00 2.00893612e+02 -1.19469658e+01 -1.53021402e+00 1.59246908e+02
1716.lowfreq: -11.2957 -9.3681 -0.0005 -0.0004 -0.0004 8.5564 29.5216 43.7650 49.9788
frequency: 28.9025 43.7262 49.8855 71.1553 90.6338 106.6302 139.6554 149.4445 152.6169 170.7113 187.9640 198.9238 214.3767 237.6281 246.7572 259.7127 277.4766 299.1114 301.1382 328.6422 337.7977 356.8374 375.0377 381.0627 413.1708 420.9620 440.8430 445.2433 455.2867 471.4778 483.5655 500.5377 521.2896 552.6216 557.2266 587.2604 605.2870 625.1258 642.8885 676.5472 697.4648 756.2014 784.2775 808.5619 811.7369 815.2671 848.5667 863.2526 880.4074 899.2684 906.9975 925.5834 929.9166 948.5485 963.7909 969.9949 983.9776 1007.2344 1008.9911 1014.5383 1017.9266 1029.8529 1036.1656 1044.0408 1046.2571 1069.4858 1081.7027 1091.7301 1103.9199 1112.1487 1128.2537 1142.5080 1147.8071 1160.1926 1165.1567 1175.5926 1190.8264 1201.9264 1209.9971 1219.7559 1221.8618 1233.6789 1239.8207 1255.4486 1265.9950 1267.6363 1278.9684 1283.5500 1286.0650 1291.6818 1300.9928 1312.7776 1319.9395 1320.3171 1325.9240 1333.7783 1337.5892 1341.4367 1346.4253 1353.2890 1354.9183 1364.6324 1365.8364 1395.2590 1440.5848 1441.0673 1449.2337 1454.1954 1458.6427 1463.2714 1468.5738 1469.0065 1471.2950 1479.8011 1494.1473 1496.9114 1587.1145 1610.1480 1628.6319 2899.1751 2922.9791 2934.5203 2942.1024 2950.1399 2955.1771 2969.6736 2973.1759 2975.9130 2978.6237 2986.5778 2991.0985 2994.5953 3017.6910 3035.4239 3036.0209 3039.9223 3045.5246 3050.8462 3056.4150 3064.8190 3076.0024 3077.3030 3085.2409 3098.6521 3118.9748 3121.2283 3532.8135
redmass: 5.5478 4.1707 3.4102 5.2778 3.9589 2.4558 1.2434 1.9297 4.1099 2.7048 5.0160 2.8946 2.1456 2.3579 1.6662 3.7015 3.0032 2.7178 2.2885 3.6367 2.8052 3.1920 3.1624 3.4958 1.4701 3.2442 2.1292 2.5945 3.9061 3.6390 2.7459 3.8651 2.5060 2.5629 2.8129 3.5578 2.7269 3.5061 3.3556 2.7713 2.7935 2.2447 1.9288 2.3539 2.1280 2.3938 1.9598 2.4923 2.2904 1.4380 2.1369 2.1906 1.8684 2.1308 2.6424 2.1059 2.1196 1.9492 1.9806 1.9054 2.1485 2.1677 2.2677 1.9714 2.2740 2.2222 2.0839 2.8610 1.9794 1.5510 1.9166 1.8343 1.6113 2.1072 1.6779 1.4703 1.8722 1.6611 1.5281 1.5270 1.6097 1.7201 1.5636 1.5430 1.5941 1.5425 1.6194 1.3747 1.5545 1.4235 1.3669 1.5758 1.4137 1.4961 1.3749 1.5234 1.3031 1.4659 1.9011 1.6696 1.5118 1.4620 1.3149 1.1959 1.0803 1.0827 1.0899 1.0546 1.0711 1.0775 1.0895 1.0880 1.0857 1.0849 1.0630 1.0603 9.9436 8.2057 7.7471 1.0788 1.0808 1.0811 1.0669 1.0735 1.0750 1.0673 1.0617 1.0618 1.0620 1.0379 1.0552 1.0442 1.0619 1.0952 1.0973 1.0999 1.0965 1.0975 1.1004 1.0952 1.0953 1.0973 1.1020 1.0989 1.0913 1.1016 1.0655
irintensity: 1.4932 6.2984 1.6001 0.5481 0.4655 0.8249 0.3529 0.2989 4.7376 1.7594 1.7238 0.1183 0.8998 1.2357 0.8453 6.2138 2.0183 1.8138 0.5204 2.5315 3.1079 8.7238 2.0018 2.1711 120.9794 3.1210 32.4091 56.2463 5.7691 1.5909 4.7791 0.9074 1.3253 2.1584 9.2628 12.8099 1.4091 10.9905 0.0325 6.9160 4.9710 6.3127 5.4005 1.5766 1.3334 0.1002 8.7960 8.9505 3.3612 25.7503 13.9854 20.9422 15.7487 12.1020 14.8554 16.2055 1.5232 3.8651 4.2364 6.1299 2.3843 11.1699 20.4985 1.9288 11.3192 7.2352 2.5676 4.6559 3.3849 4.2955 0.3246 13.9593 2.8351 0.1719 2.0888 7.6616 1.5025 30.5690 35.1969 4.9855 4.7914 14.9658 17.4170 5.3339 41.2320 58.8486 12.0668 4.6945 1.5809 4.0402 0.5507 5.9138 7.1699 7.8702 1.0761 1.3954 2.4224 0.9403 7.5569 7.3625 2.7560 15.4969 58.8489 32.2856 22.9115 14.3205 14.1835 17.5473 6.3332 9.0779 13.9524 6.9703 4.5009 11.1254 10.0779 3.9627 170.1662 85.5931 204.4801 6.8736 3.1393 7.2764 21.5241 8.6933 45.8683 13.5074 20.1544 52.7637 32.5874 2.4063 15.0381 41.1626 36.6629 26.3386 51.6368 45.6391 29.0320 33.0356 17.8605 21.3002 5.5562 43.6004 24.3475 11.8231 10.4897 14.7887 6.2537
temp: 298.150 k
press: 1.00000 atm
elementType: 8 8 8 6 6 6 6 6 6 6 6 6 6 6 6 6 6 6 6 6 6 6 6 1 1 1 1 1 1 1 1 1 1 1 1 1 1 1 1 1 1 1 1 1 1 1 1 1 1 1 1
symmnumber: 1
zpe: 1150484.9 jmol-1
zpe.correction: 0.438197 hartree
zpe.thermalcorrener: 0.460027 hartree
zpe.thermalcorrenthalpy: 0.460971 hartree
zpe.thermalcorrgfe: 0.388646 hartree
zpe.sumelectzpe: -1002.831418 hartree
zpe.sumelectthermal: -1002.809587 hartree
zpe.sumelectthermalent: -1002.808643 hartree
zpe.sumelectthermalfe: -1002.880968 hartree
dipole: -4.8629 1.7698 1.6328
dipole: 5.4264
quadrupole: -183.3191 -136.6306 -139.1762
quadrupole: -7.9752 10.1993 4.5775
quadrupole: -30.2771 16.4114 13.8657 -7.9752 10.1993 4.5775
hfenergy: -1003.2696143 hartree
pointgroup: C01 [X(C20H28O3)]
dipole: -1.9052628 -0.7065929 -0.6545973 debye
polarizability: 290.768205|10.0679778|201.0503791|12.5874544|-1.1695241|159.339662 unknown
InChI: InChI=1S/C20H28O3/c1-12(21)20(23)10-8-18-17-5-3-13-11-14(22)4-6-15(13)16(17)7-9-19(18,20)2/h11,15-18,23H,3-10H2,1-2H3
charge 0 multiplicity 1
51 atoms
O  -3.39788 0.042614 1.854888
O  -4.508442 1.942253 -0.470725
O  6.508909 0.373366 0.790241
C  -2.044969 0.278575 -0.285921
C  -1.198643 -0.962066 0.15196
C  0.24078 -0.942799 -0.398204
C  0.951648 0.360254 0.085325
C  -3.42489 -0.098879 0.360336
C  -1.349045 1.557346 0.238111
C  -2.115773 -2.16749 -0.170839
C  0.122919 1.63195 -0.249714
C  -3.559562 -1.631622 0.112617
C  2.416019 0.470499 -0.464862
C  1.052994 -2.181118 0.039196
C  -2.233136 0.36481 -1.827736
C  2.491145 -2.124566 -0.530777
C  3.201582 -0.819939 -0.221331
C  3.149024 1.705475 0.125245
C  -4.649547 0.765842 -0.034857
C  4.667852 1.696447 -0.145913
C  4.503745 -0.818597 0.211017
C  -6.027549 0.177093 0.229476
C  5.31906 0.405181 0.349016
H  -1.123904 -0.904117 1.260647
H  0.209952 -0.93866 -1.510748
H  1.025365 0.287277 1.195134
H  -1.331511 1.548358 1.349183
H  -1.900623 2.460474 -0.081058
H  -1.884141 -3.052739 0.445969
H  -2.009426 -2.467286 -1.231008
H  0.149239 1.805143 -1.344895
H  0.594126 2.51769 0.214784
H  -4.240636 -1.843221 -0.730585
H  -3.996748 -2.090916 1.015562
H  2.33396 0.599848 -1.570735
H  0.55819 -3.107719 -0.308571
H  1.088739 -2.227139 1.146954
H  -1.26459 0.38871 -2.354342
H  -2.799787 -0.495078 -2.228898
H  -2.783819 1.284234 -2.086452
H  2.421293 -2.222948 -1.636811
H  3.093949 -2.98002 -0.174747
H  2.979023 1.722782 1.221327
H  2.712036 2.634316 -0.283281
H  -3.174626 0.985755 2.073029
H  5.174114 2.555412 0.328571
H  4.858099 1.77071 -1.237413
H  5.022971 -1.763056 0.421091
H  -6.271697 -0.578415 -0.541802
H  -6.049188 -0.332206 1.20864
H  -6.787601 0.973383 0.195304
