program: Gaussian 09
title: 000100148
version: EM64L-G09RevD.01
frameworkgroup: C1[X(C11H22N2O4)]
method: RPBEPBE
basis: SDD
operation: Freq
keyword: #p
keyword: freq=noraman
keyword: PBEPBE/SDD
title: #p freq=noraman PBEPBE/SDD
converged: YES YES NO NO
title: Mulliken charges:
elementType: O O O O N N C C C C C C C C C C C H H H H H H H H H H H H H H H H H H H H H H
charge: -0.328961 -0.405648 -0.232726 -0.310841 -0.411166 -0.570929 -0.383389 -0.347602 -0.157081 -0.362473 0.339380 -0.399581 -0.711542 -0.703274 -0.713460 0.135956 0.321735 0.204189 0.227708 0.206647 0.208065 0.289886 0.182780 0.218879 0.340330 0.181249 0.211230 0.220705 0.208490 0.269384 0.226848 0.229167 0.203329 0.268509 0.209418 0.217914 0.257937 0.273327 0.385610
chargesum: 0.00000
title: Mulliken charges with hydrogens summed into heavy atoms:
elementType: O O O O N N C C C C C C C C C C C
charge: -0.328961 -0.020038 -0.232726 -0.310841 -0.070836 -0.039665 0.048508 0.067110 0.132805 0.039186 0.339380 -0.007102 -0.012963 -0.043931 -0.017619 0.135956 0.321735
polarizability: 1.66215465e+02 6.43422877e+00 1.58413941e+02 4.80901429e+00 -4.94923744e+00 1.23571345e+02
1716.lowfreq: -0.0011 -0.0009 -0.0007 4.8827 8.9428 10.7370 26.7916 31.4627 49.1200
frequency: 26.7298 31.3528 49.1138 54.5323 60.7539 64.9276 86.7633 98.0087 119.2500 127.5639 136.5953 163.5593 185.3755 200.4102 218.4134 238.5510 244.0327 257.6836 276.4434 291.5013 311.2493 333.6240 363.5207 397.1526 407.5391 435.0528 438.0506 478.0317 531.0794 578.1284 593.0029 601.6847 606.8773 698.5209 702.3420 705.6436 726.4506 740.6052 790.8560 817.9375 887.0459 903.9192 915.6622 923.7014 939.4138 955.5205 979.8261 999.6853 1032.7117 1033.4302 1035.5908 1057.4824 1066.5290 1091.9846 1105.3020 1121.7603 1158.7859 1175.7410 1209.7265 1220.8849 1226.2848 1251.8130 1255.7234 1271.4421 1278.5529 1287.6964 1297.6626 1313.8911 1326.7636 1340.2221 1358.8679 1375.2412 1378.7869 1388.0425 1401.8412 1446.5274 1455.9512 1463.7849 1467.5362 1468.2047 1470.8730 1476.2096 1481.2279 1483.3569 1492.4352 1503.2822 1637.2134 1638.6444 1656.1330 2866.1077 2956.4912 2976.0108 2984.7164 2988.6871 2990.7321 2995.5188 3010.6346 3021.5683 3031.6721 3043.0124 3062.9248 3080.1878 3083.9084 3097.1592 3099.2841 3113.2403 3117.3671 3451.5242 3514.5469 3545.3416 3579.2575
redmass: 4.1894 3.4188 4.4340 2.3957 4.4894 3.5479 5.4960 4.2268 3.6460 2.1032 2.7152 3.2862 1.1239 3.3031 2.7692 1.2283 1.2893 1.0654 3.2236 4.0726 4.0778 2.5930 3.3998 3.1351 2.9921 2.8412 2.9392 2.8564 3.0963 1.4064 1.2894 1.9366 1.6782 5.6575 4.6161 8.2851 3.1811 1.2765 1.2493 3.2277 1.7140 3.5810 1.5950 1.6963 2.0939 1.2028 3.5421 2.3798 1.4343 2.1357 1.7411 2.4829 2.5132 2.7697 2.4513 1.7774 2.4626 2.3649 1.4265 1.6411 1.4638 1.4295 3.0410 2.9999 1.2876 1.0728 1.1695 1.3530 1.3188 2.0055 1.5397 1.2250 1.2332 1.4612 1.2182 1.0465 1.1284 1.0754 1.0564 1.0531 1.0697 1.1734 1.0533 1.6088 1.0914 1.0649 8.6229 1.0996 8.6262 1.0715 1.0646 1.0610 1.0602 1.0362 1.0357 1.0363 1.0858 1.0965 1.0868 1.0985 1.1032 1.0993 1.0990 1.0992 1.1004 1.0999 1.0993 1.0449 1.0641 1.0770 1.0974
irintensity: 0.0878 0.0988 1.1294 0.6357 4.4250 4.0730 2.5665 0.7277 2.2268 1.8138 0.8798 1.7440 0.7640 9.6557 16.5376 19.4655 16.2348 0.1882 11.9043 1.5669 11.8618 2.6836 7.4772 10.6990 7.6684 7.3295 3.8410 23.2815 18.6255 6.6340 192.2252 190.9810 95.0501 17.7221 47.2724 12.7953 10.8682 16.5176 0.9228 7.1151 5.5275 66.2076 0.8365 3.9636 4.3199 0.3158 140.2873 76.7822 0.2180 3.4062 17.6707 147.5271 4.8320 4.5554 20.1622 18.4722 429.8683 42.9038 17.3089 33.7758 2.8360 23.2246 27.7604 15.8597 5.0578 3.5850 7.2832 17.2595 10.2370 167.3341 0.7765 42.3475 40.8114 17.0458 32.7375 0.9339 50.6670 2.8245 8.6649 2.6213 22.9430 96.3059 3.7246 184.3165 3.6051 57.5799 280.7884 42.5409 152.2480 111.9949 22.0396 1.8223 61.4047 26.1460 9.7838 30.0867 27.7390 5.2135 7.8189 14.5397 93.0901 11.1851 22.8081 54.4649 30.1672 5.0529 16.5259 1.6746 29.0618 58.7205 0.1520
temp: 298.150 k
press: 1.00000 atm
elementType: 8 8 8 8 7 7 6 6 6 6 6 6 6 6 6 6 6 1 1 1 1 1 1 1 1 1 1 1 1 1 1 1 1 1 1 1 1 1 1
symmnumber: 1
zpe: 864348.1 jmol-1
zpe.correction: 0.329213 hartree
zpe.thermalcorrener: 0.350267 hartree
zpe.thermalcorrenthalpy: 0.351212 hartree
zpe.thermalcorrgfe: 0.277809 hartree
zpe.sumelectzpe: -841.413613 hartree
zpe.sumelectthermal: -841.392558 hartree
zpe.sumelectthermalent: -841.391614 hartree
zpe.sumelectthermalfe: -841.465017 hartree
dipole: -0.1455 -0.8465 -1.2955
dipole: 1.5544
quadrupole: -101.3645 -89.6380 -107.6154
quadrupole: 5.7791 -3.6870 6.4682
quadrupole: -1.8252 9.9013 -8.0761 5.7791 -3.6870 6.4682
hfenergy: -841.7428254 hartree
pointgroup: C01 [X(C11H22N2O4)]
dipole: -0.0045307 -0.427709 0.4370554 debye
polarizability: 164.1610415|-8.6159672|156.9540821|6.0566159|10.3550344|127.0856278 unknown
InChI: InChI=1S/C11H22N2O4/c1-11(2,3)17-10(16)13-8(9(14)15)6-4-5-7-12/h8,13-14H,4-7,12H2,1-3H3
charge 0 multiplicity 1
39 atoms
O  2.197442 -0.515418 0.688941
O  -1.269324 4.066822 0.032378
O  0.112398 3.43717 1.790948
O  1.022199 -0.100134 -1.33769
N  0.44812 0.914512 0.695984
N  -5.270976 -2.625517 -0.467533
C  -2.053203 1.167117 0.386858
C  -2.256603 -0.209625 -0.278207
C  -0.620201 1.744141 0.138309
C  -3.682134 -0.760347 -0.052888
C  3.178536 -1.504175 0.073575
C  -3.896135 -2.139846 -0.70872
C  4.00441 -0.797194 -1.019696
C  4.04871 -1.880356 1.285439
C  2.403412 -2.723364 -0.466403
C  -0.517884 3.137409 0.752176
C  1.209087 0.081906 -0.102776
H  -2.225007 1.088558 1.479494
H  -2.7876 1.892274 -0.012795
H  -1.512184 -0.925292 0.122535
H  -2.052363 -0.125732 -1.364107
H  -0.461078 1.811875 -0.953705
H  -3.879599 -0.841278 1.03783
H  -4.439126 -0.062806 -0.460617
H  0.745479 1.080697 1.660374
H  -3.098567 -2.83515 -0.345256
H  -3.755763 -2.041746 -1.802524
H  4.491172 0.106204 -0.611117
H  4.794434 -1.479631 -1.383716
H  3.36614 -0.507934 -1.869135
H  3.430769 -2.328904 2.082361
H  4.551373 -0.987286 1.694658
H  4.818986 -2.611862 0.982357
H  1.759279 -2.436424 -1.312498
H  3.119627 -3.492216 -0.809676
H  1.77856 -3.166245 0.329711
H  -5.491883 -2.760203 0.524795
H  -5.539733 -3.438392 -1.030298
H  -1.215067 4.956393 0.476334
