program: Gaussian 09
title: 000102230
version: EM64L-G09RevD.01
frameworkgroup: C1[X(C20H24Cl2N2)]
method: RPBEPBE
basis: SDD
operation: Freq
keyword: #p
keyword: freq=noraman
keyword: PBEPBE/SDD
title: #p freq=noraman PBEPBE/SDD
converged: YES YES NO NO
title: Mulliken charges:
elementType: Cl Cl N N C C C C C C C C C C C C C C C C C C C C H H H H H H H H H H H H H H H H H H H H H H H H
charge: -0.074409 -0.074386 -0.378709 -0.378652 0.027753 0.027733 -0.427886 -0.481258 -0.427909 -0.481234 -0.467292 -0.467235 0.494041 0.493970 -0.311637 -0.311523 -0.401565 -0.401682 -0.233245 -0.233248 -0.233393 -0.233393 -0.228302 -0.228296 0.179662 0.179652 0.199612 0.210930 0.215778 0.188542 0.199626 0.210936 0.215790 0.188530 0.253832 0.253817 0.237021 0.223794 0.237050 0.223759 0.289074 0.289055 0.254730 0.254730 0.229626 0.229627 0.233291 0.233293
chargesum: 0.00000
title: Mulliken charges with hydrogens summed into heavy atoms:
elementType: Cl Cl N N C C C C C C C C C C C C C C C C C C C C
charge: -0.074409 -0.074386 -0.124876 -0.124836 0.207414 0.207385 -0.017344 -0.076938 -0.017347 -0.076914 -0.006477 -0.006426 0.494041 0.493970 -0.311637 -0.311523 -0.112491 -0.112627 0.021485 0.021483 -0.003768 -0.003766 0.004989 0.004997
polarizability: 3.28026879e+02 2.13702100e+01 2.45089235e+02 8.02263115e-03 4.12632897e-02 1.59646441e+02
1716.lowfreq: -3.8876 -0.0019 -0.0011 0.0008 5.7211 9.7695 14.0638 15.1437 18.6202
frequency: 14.0500 15.1304 18.6077 33.1260 41.8300 47.5747 88.1049 95.2336 126.0690 136.9424 142.8132 145.7200 176.1062 201.2156 219.7467 226.5500 230.2180 253.2068 277.0918 313.5738 361.4558 361.8920 370.8186 402.5418 421.6478 435.3635 439.6906 441.3664 454.4269 485.8007 503.0030 513.8503 514.0353 566.4175 599.9795 631.0168 669.9695 670.0890 687.9088 699.4685 711.2897 712.4937 762.6589 762.7445 777.1421 787.7472 808.9179 812.9958 870.3738 873.5377 874.4648 898.2068 936.1456 946.3465 952.4085 960.4199 973.6769 984.7279 1001.0623 1004.6650 1013.1395 1015.0751 1035.7201 1036.4516 1040.9832 1046.1989 1068.4822 1073.9209 1104.3274 1114.7971 1115.0706 1128.2080 1144.1274 1145.7443 1161.9123 1167.2519 1167.2972 1205.5250 1207.8308 1214.6037 1220.5069 1223.2875 1235.9787 1250.1131 1261.8737 1262.7712 1293.8333 1296.7445 1302.5429 1318.5417 1328.7671 1335.4698 1345.1862 1350.9850 1363.3415 1373.6862 1387.5497 1388.2182 1424.6659 1424.6855 1455.5668 1456.4844 1457.3277 1460.9698 1465.5760 1466.8575 1472.3230 1473.7616 1476.5055 1479.2607 1573.3351 1573.4405 1607.7286 1607.7809 2831.6770 2831.7897 2896.6472 2896.8189 2961.3911 2972.1373 2980.8494 2986.9018 3003.8057 3003.8584 3016.4435 3033.2091 3039.2857 3049.4227 3132.7258 3132.7273 3147.9754 3147.9840 3159.8103 3159.8155 3173.3526 3173.3771 3412.2597 3412.5055
redmass: 9.7384 6.1309 5.2139 3.5391 3.3396 6.0345 3.8203 5.3698 5.6514 3.7630 3.2867 2.7607 4.9222 5.8037 1.8228 4.1601 3.3233 4.1861 2.7368 4.9103 3.4773 6.6398 6.3235 3.3989 3.8212 3.4209 2.9771 3.0865 2.2364 3.1907 3.6473 3.5214 3.8798 4.9825 5.4054 3.2736 3.2483 3.1410 1.8962 2.2937 2.9082 2.4501 1.2413 1.2411 2.8949 1.5257 3.5265 3.6216 1.8756 1.2886 1.4165 1.3698 1.9070 1.4866 1.4550 2.5372 1.7019 1.5801 1.4523 1.9334 5.9325 3.4769 2.0977 2.0480 2.1613 1.4862 1.6329 1.9605 2.2557 1.7348 1.8480 2.2873 3.3085 3.4195 1.8232 1.0633 1.0626 1.6052 1.9829 1.3644 1.3278 1.3226 1.3442 1.2933 1.4659 1.5377 1.4415 1.2489 1.1959 1.2848 1.4671 1.4462 1.6412 1.8583 2.0914 1.8227 2.7778 2.5465 2.1500 2.1508 1.3742 2.0448 1.7219 1.1312 1.1612 1.2727 1.0983 1.1368 1.1583 1.1249 6.2109 6.2092 7.1514 7.1469 1.0809 1.0814 1.0706 1.0706 1.0589 1.0607 1.0582 1.0634 1.0862 1.0860 1.1014 1.1021 1.0996 1.1026 1.0856 1.0856 1.0902 1.0902 1.0953 1.0953 1.0995 1.0995 1.0740 1.0739
irintensity: 0.3865 0.3240 0.0083 0.0573 0.6924 0.0000 0.7525 3.3500 0.3504 0.0243 4.3167 0.0866 0.9062 1.2104 1.0982 0.7727 8.6129 0.2996 0.2472 0.0224 5.7356 0.0538 4.0902 19.7458 3.6379 0.3254 2.5515 9.3684 2.7377 10.4713 1.1660 6.9618 0.2263 5.9582 0.0002 31.3248 0.7262 6.2860 12.1014 87.6476 2.4394 48.1675 18.1979 148.6883 0.2951 4.9742 1.7340 0.9850 2.7318 0.8952 0.3699 7.8851 3.0155 0.7075 1.4369 0.0118 5.4603 13.6859 8.6541 23.9574 9.4708 76.5897 29.8795 1.5617 0.1496 0.6550 11.9189 1.6668 0.1086 10.8049 0.8456 0.0583 7.5107 148.1406 8.4584 5.4309 0.3698 0.1002 5.9987 14.1564 0.0585 39.5413 0.4926 0.1748 0.0053 8.4591 0.1240 0.0733 15.3323 1.7123 0.0011 11.1591 0.3319 12.6811 3.0490 77.3263 0.0244 0.8614 5.5868 34.0371 20.6520 8.7665 94.7658 3.1241 9.5108 9.1334 20.6929 0.1416 3.6551 0.0813 23.0976 4.5427 2.3939 0.2957 147.6353 3.2356 55.8293 25.8562 37.9232 62.6682 54.1588 9.5742 20.8695 3.4562 36.5223 39.5115 27.5042 76.4338 2.0761 4.2049 5.3147 4.3567 23.0075 4.7655 37.4392 0.0873 4.4545 0.9243
temp: 298.150 k
press: 1.00000 atm
elementType: 17 17 7 7 6 6 6 6 6 6 6 6 6 6 6 6 6 6 6 6 6 6 6 6 1 1 1 1 1 1 1 1 1 1 1 1 1 1 1 1 1 1 1 1 1 1 1 1
symmnumber: 1
zpe: 1038506.8 jmol-1
zpe.correction: 0.395546 hartree
zpe.thermalcorrener: 0.418504 hartree
zpe.thermalcorrenthalpy: 0.419448 hartree
zpe.thermalcorrgfe: 0.338774 hartree
zpe.sumelectzpe: -1804.363045 hartree
zpe.sumelectthermal: -1804.340088 hartree
zpe.sumelectthermalent: -1804.339143 hartree
zpe.sumelectthermalfe: -1804.419818 hartree
dipole: -0.0016 -0.0017 2.3186
dipole: 2.3186
quadrupole: -152.2140 -156.6345 -157.3055
quadrupole: 18.4886 0.0113 -0.0036
quadrupole: 3.1706 -1.2498 -1.9208 18.4886 0.0113 -0.0036
hfenergy: -1804.7585912 hartree
pointgroup: C01 [X(C20H24Cl2N2)]
dipole: -0.0005198 0.0007903 0.9122007 debye
polarizability: 330.7459314|14.9592634|242.3700989|-0.0408199|-0.0908519|159.6465244 unknown
InChI: InChI=1S/C20H24Cl2N2/c21-19-7-3-1-5-15(19)13-23-17-9-11-18(12-10-17)24-14-16-6-2-4-8-20(16)22/h1-8,17-18,23-24H,9-14H2
charge 0 multiplicity 1
48 atoms
Cl 6.03126 -2.643516 -1.480495
Cl -6.03002 2.640582 -1.483981
N  2.890758 -0.032171 0.601623
N  -2.89073 0.030855 0.601965
C  1.452629 -0.401655 0.56186
C  -1.452589 0.400327 0.561799
C  0.75632 0.160495 -0.701872
C  0.757276 0.151897 1.826912
C  -0.756427 -0.162512 -0.701712
C  -0.757094 -0.15254 1.827066
C  3.767176 -0.773278 -0.329629
C  -3.767158 0.771252 -0.32985
C  5.175763 -0.191755 -0.381884
C  -5.176032 0.190353 -0.38091
C  6.280803 -0.925741 -0.872833
C  -6.280666 0.924108 -0.873145
C  5.434355 1.135058 0.051755
C  -5.43541 -1.135482 0.055215
C  7.585481 -0.401696 -0.937158
C  -7.585671 0.400773 -0.93638
C  6.73201 1.688811 -0.000126
C  -6.73343 -1.688512 0.004484
C  7.81186 0.920834 -0.492367
C  -7.81284 -0.920783 -0.489088
H  1.317236 -1.515656 0.557385
H  -1.317214 1.514329 0.556675
H  1.21841 -0.25172 -1.618937
H  0.920441 1.25624 -0.722467
H  0.926252 1.24701 1.864707
H  1.224868 -0.281875 2.734716
H  -1.218603 0.249217 -1.618949
H  -0.920553 -1.258265 -0.721685
H  -0.926069 -1.247626 1.865452
H  -1.224596 0.281714 2.734691
H  3.255427 -0.088938 1.564344
H  -3.255314 0.088636 1.564667
H  3.324261 -0.715362 -1.343185
H  3.832803 -1.861817 -0.094164
H  -3.324638 0.712003 -1.343496
H  -3.832207 1.8601 -0.095588
H  4.579848 1.712923 0.41848
H  -4.581263 -1.713313 0.422828
H  8.40435 -1.013579 -1.326451
H  -8.404192 1.012439 -1.326746
H  6.899874 2.716525 0.339839
H  -6.901896 -2.715492 0.346363
H  8.82282 1.339877 -0.535043
H  -8.824066 -1.339271 -0.530885
