program: Gaussian 09
title: 000100140
version: EM64L-G09RevD.01
frameworkgroup: C1[X(C23H26O6)]
method: RPBEPBE
basis: SDD
operation: Freq
keyword: #pfreq=noraman
keyword: PBEPBE/SDD
title: #p freq=noraman PBEPBE/SDD
converged: NO YES NO NO
title: Mulliken charges:
elementType: O O O O O O C C C C C C C C C C C C C C C C C C C C C C C H H H H H H H H H H H H H H H H H H H H H H H H H H
charge: -0.287574 -0.347353 -0.542226 -0.421041 -0.298780 -0.260223 0.349344 -0.651742 -0.563407 0.525572 -0.094588 0.162943 -0.749353 -0.779245 0.148027 0.597112 -0.029252 -0.015652 -0.698078 0.250109 0.177369 0.310090 -0.395319 -0.757043 -0.147100 -0.166302 -0.690866 -0.695968 -0.531528 0.230283 0.247760 0.307902 0.253026 0.271201 0.212760 0.230884 0.254178 0.267191 0.409185 0.272611 0.253471 0.246163 0.245627 0.422539 0.275302 0.211938 0.211938 0.229919 0.207253 0.222244 0.205775 0.215113 0.241597 0.223367 0.232848
chargesum: 0.00000
title: Mulliken charges with hydrogens summed into heavy atoms:
elementType: O O O O O O C C C C C C C C C C C C C C C C C C C C C C C
charge: -0.287574 -0.347353 -0.133041 0.001498 -0.298780 -0.260223 0.349344 -0.173699 -0.002479 0.525572 -0.094588 0.162943 -0.034508 -0.525067 0.148027 0.597112 -0.029252 -0.015652 -0.430887 0.250109 0.177369 0.310090 -0.122708 -0.011782 0.128201 0.045636 -0.041756 -0.052835 0.166284
chargesum: -0.00018
polarizability: 5.38505400e+02 -9.77045635e+00 2.58873202e+02 -4.09047009e+01 1.24269623e+01 1.87809260e+02
1716.lowfreq: -2.9958 -0.6073 -0.3626 -0.1590 3.4791 6.8430 17.6744 24.9465 31.8134
frequency: 17.6555 24.6748 31.8052 38.3991 48.1925 57.7001 71.3257 75.5464 83.7170 92.3168 114.1047 136.7966 142.3060 145.7364 159.0504 170.0287 185.4418 198.2308 206.0923 212.5096 217.0028 233.2479 247.4327 249.1812 263.9251 285.0611 286.8319 299.6213 315.9277 324.1873 340.4800 359.0968 369.3038 378.8885 394.3191 418.4729 438.3453 463.1665 470.5354 477.4530 499.1741 519.8448 538.3010 553.4395 572.3173 575.3023 579.8322 586.2803 602.3067 633.1025 635.7547 661.8231 687.7041 725.0947 730.0945 743.6565 781.6917 791.2337 843.7124 847.6344 857.8272 864.1627 871.2167 875.4832 883.5429 907.1098 918.3953 919.0536 926.9457 940.7639 953.6972 955.8634 963.5838 979.4890 995.1274 1011.0654 1040.8463 1043.6102 1071.7713 1076.4907 1090.1422 1102.3503 1108.6657 1130.6465 1141.0692 1144.8888 1151.8637 1154.9302 1181.0880 1184.6056 1195.0594 1198.9142 1233.5595 1252.2857 1260.5275 1262.9997 1284.7911 1296.6487 1302.0507 1311.3536 1324.6824 1332.2116 1344.9108 1372.4322 1372.9697 1382.2571 1386.8734 1387.9895 1391.1947 1409.8656 1416.0506 1429.4777 1433.1188 1442.5704 1450.0432 1452.0575 1453.4585 1454.5135 1458.8742 1464.4692 1465.8394 1466.3195 1470.6135 1477.6590 1486.6634 1487.0394 1512.4734 1557.7240 1580.1054 1616.4115 1624.1417 1643.4840 1646.5344 1915.4226 2966.5440 2968.3985 2972.1391 2972.5018 2981.7259 2985.5187 2993.5956 3007.9979 3025.7546 3055.1291 3059.8919 3061.5105 3068.8646 3074.4526 3081.1320 3082.1449 3085.3525 3096.4593 3105.6937 3116.7298 3117.5935 3119.8749 3129.8956 3142.7749 3157.1678
redmass: 4.0599 1.4420 3.7949 2.6517 3.4561 3.6574 3.0627 4.4794 5.3149 4.5941 3.5374 2.7076 1.5376 3.8263 2.9197 4.9370 4.4203 1.3848 2.7357 1.1468 2.2195 1.3491 3.3301 3.3680 3.5655 3.7935 3.1090 3.9196 2.5185 3.9605 3.4394 3.5398 2.8134 3.5930 3.5482 3.7773 3.2652 4.5885 4.6767 4.3053 5.0815 5.8415 5.0989 4.1086 3.4475 5.0118 4.6670 5.1316 4.7952 4.4525 3.6940 5.6526 5.5221 5.5029 5.5172 4.7644 4.8576 4.7181 1.6994 2.1437 1.0882 3.1513 2.7438 2.2613 2.2449 3.0914 1.1980 2.1915 3.2949 2.1666 1.4785 2.0291 1.7725 2.3099 1.8580 1.1089 1.6830 5.1800 5.4097 2.3955 4.2731 2.5376 1.2521 2.5545 1.8326 1.8599 1.4697 1.6253 1.8602 1.0951 2.6790 1.5935 2.1308 1.4368 1.5822 2.6245 1.4846 1.7800 1.3272 1.8714 3.0277 2.2006 2.2471 2.3594 1.1948 1.2421 1.4240 2.2700 1.4094 4.4655 2.2659 1.1614 1.6335 1.3666 2.9566 1.1737 1.0526 2.1260 1.0545 1.1360 1.0497 1.0508 1.0531 1.0495 1.0568 1.0566 4.4290 5.0145 4.6924 3.2528 7.2784 8.6901 6.2847 1.0850 1.0310 1.0347 1.0362 1.0642 1.0845 1.0655 1.0386 1.0366 1.0686 1.0948 1.1040 1.1001 1.0992 1.1003 1.0925 1.0997 1.0988 1.0973 1.0929 1.0994 1.1017 1.0858 1.0915 1.1012 1.0918
irintensity: 0.5665 1.8182 0.4483 0.3359 0.8990 1.4005 1.2287 0.7580 4.7089 1.7187 1.6865 0.4788 0.4290 2.3733 5.9903 2.0454 8.1071 0.3051 0.9920 0.1998 1.5659 3.2811 1.6651 1.7693 7.7552 4.3536 6.5273 0.7049 2.3667 2.0704 1.9485 5.4052 0.5265 6.9015 16.5611 4.4384 6.8287 1.3686 10.8061 9.8178 2.4502 28.8071 10.6345 1.3562 8.6257 15.1461 3.0360 5.4538 10.4473 3.9386 6.4209 4.9077 7.6278 2.9754 6.7062 4.1939 4.6450 4.6650 0.3619 0.7030 116.9344 9.1008 8.7154 3.4069 1.1606 78.3650 1.0355 10.7374 64.7675 19.4880 2.9803 52.1831 3.2923 23.4669 86.2464 50.8251 10.7323 37.1784 91.8233 97.9940 34.1716 3.8709 4.9794 68.6890 13.5975 13.0005 23.5371 36.9826 13.3639 69.9862 460.8474 12.0813 2.7295 15.6254 5.4863 22.4289 39.2707 6.7831 0.3516 28.4221 34.3647 103.2320 8.8552 323.6715 14.9456 48.2598 24.4999 111.3095 29.1838 29.1988 68.1875 30.5665 35.1977 14.0369 10.5010 41.2745 17.7621 29.6112 16.4056 7.9126 6.7675 3.3778 5.5275 11.3588 18.4997 13.8831 100.3667 354.1190 315.1350 8.8093 553.5210 212.9648 79.1099 319.8787 58.5026 58.0615 74.3379 11.6405 14.4384 6.9820 28.6596 1.5942 265.2129 9.8866 33.9788 1.3886 102.4263 36.3957 3.4232 46.2913 24.8914 6.8316 6.6007 6.0542 24.5386 18.3641 11.3402 11.1396 3.5837
temp: 298.150 k
press: 1.00000 atm
elementType: 8 8 8 8 8 8 6 6 6 6 6 6 6 6 6 6 6 6 6 6 6 6 6 6 6 6 6 6 6 1 1 1 1 1 1 1 1 1 1 1 1 1 1 1 1 1 1 1 1 1 1 1 1 1 1
symmnumber: 1
zpe: 1146837.1 jmol-1
zpe.correction: 0.436807 hartree
zpe.thermalcorrener: 0.465923 hartree
zpe.thermalcorrenthalpy: 0.466868 hartree
zpe.thermalcorrgfe: 0.375907 hartree
zpe.sumelectzpe: -1341.288468 hartree
zpe.sumelectthermal: -1341.259352 hartree
zpe.sumelectthermalent: -1341.258408 hartree
zpe.sumelectthermalfe: -1341.349368 hartree
dipole: 0.3624 4.7319 -0.5239
dipole: 4.7746
quadrupole: -163.9738 -169.7573 -167.1959
quadrupole: 13.0254 2.6288 -7.2946
quadrupole: 3.0019 -2.7817 -0.2202 13.0254 2.6288 -7.2946
hfenergy: -1341.7252752 hartree
pointgroup: C01 [X(C23H26O6)]
dipole: 0.1226593 -1.855497 -0.265963 debye
polarizability: 535.0949031|-6.3538507|248.3878604|54.0373858|27.3224975|201.7050982 unknown
InChI: InChI=1S/C23H26O6/c1-12(2)6-7-16-17(26-5)9-14-8-15-10-23(4,27-13(3)24)11-18-19(15)22(29-30-28-18)20(14)21(16)25/h6-9,12,25H,10-11H2,1-5H3
charge 0 multiplicity 1
55 atoms
O  4.483231 -0.051168 -1.093113
O  2.96523 1.840731 2.196306
O  0.591308 1.805674 1.791546
O  -1.910879 1.819413 1.304456
O  -3.783283 -1.914907 -1.233753
O  6.286471 1.41273 -0.751293
C  4.686958 -0.816407 0.202983
C  3.533556 -1.845447 0.16648
C  4.52836 0.144059 1.408195
C  2.15307 -1.214454 0.2405
C  2.00515 0.029354 0.964658
C  3.133573 0.711439 1.541806
C  6.060806 -1.506891 0.188025
C  1.034603 -1.801228 -0.331591
C  0.710285 0.624909 1.096995
C  -0.279824 -1.215175 -0.210708
C  -0.449165 0.021718 0.519105
C  -1.754547 0.623024 0.628655
C  -1.434006 -1.81811 -0.774266
C  -2.906991 0.032488 0.033414
C  -2.698586 -1.222752 -0.637853
C  5.323707 1.012196 -1.44484
C  -4.182696 0.761222 0.135821
C  4.884795 1.589002 -2.773856
C  -5.322452 0.578552 -0.59694
C  -6.568665 1.428372 -0.444686
C  -6.872484 2.186479 -1.766143
C  -7.782257 0.550803 -0.032285
C  -4.622528 -2.664168 -0.272642
H  3.677379 -2.528932 1.028931
H  3.625819 -2.457282 -0.74808
H  5.256766 0.969461 1.35324
H  4.758441 -0.423076 2.333676
H  6.875457 -0.767343 0.229545
H  6.151593 -2.184065 1.056994
H  6.174471 -2.109393 -0.730388
H  1.13341 -2.736718 -0.894115
H  -1.360572 -2.763057 -1.32104
H  1.650388 2.061418 2.12459
H  -4.161233 1.584937 0.860689
H  3.845265 1.953458 -2.703407
H  4.904725 0.808788 -3.554187
H  5.551329 2.416737 -3.055418
H  -1.002941 2.114626 1.663373
H  -5.359243 -0.202189 -1.369476
H  -6.39226 2.177669 0.35361
H  -7.782596 2.80663 -1.661028
H  -6.031998 2.84531 -2.04779
H  -7.040334 1.474115 -2.596508
H  -7.597721 0.040044 0.930177
H  -7.983415 -0.222632 -0.798467
H  -8.694239 1.168221 0.07254
H  -5.053776 -1.992229 0.492429
H  -4.023369 -3.456667 0.215175
H  -5.427083 -3.116895 -0.872139
