program: Gaussian 09
title: 000100139
version: EM64L-G09RevD.01
frameworkgroup: C1[X(C11H19NO)]
method: RPBEPBE
basis: SDD
operation: Freq
keyword: #p
keyword: freq=noraman
keyword: PBEPBE/SDD
title: #p freq=noraman PBEPBE/SDD
converged: YES YES NO NO
title: Mulliken charges:
elementType: O N C C C C C C C C C C C H H H H H H H H H H H H H H H H H H H
charge: -0.187780 -0.135250 -0.088631 -0.494875 -0.359766 -0.363057 -0.404182 -0.401947 -0.388111 -0.400036 0.107235 -0.399464 -0.488934 0.237514 0.221526 0.222779 0.178191 0.213982 0.230666 0.181888 0.193947 0.202512 0.201855 0.196668 0.217774 0.205972 0.215310 0.192008 0.211857 0.211232 0.238252 0.230862
chargesum: 0.00000
title: Mulliken charges with hydrogens summed into heavy atoms:
elementType: O N C C C C C C C C C C C
charge: -0.187780 -0.135250 0.148883 -0.050570 0.032408 0.049498 -0.007723 -0.003424 0.035636 0.007282 0.107235 0.023625 -0.019820
polarizability: 1.35132556e+02 -1.14810912e+00 1.21286362e+02 -6.10855752e-02 -1.22279664e+00 1.07371496e+02
1716.lowfreq: -16.8203 -11.7229 -0.0004 0.0007 0.0010 18.3667 42.9552 67.3949 99.6331
frequency: 42.8192 67.1870 99.5933 125.2849 154.3782 226.4884 239.4364 292.0500 295.4295 351.1807 372.2981 383.2942 440.3230 442.2330 456.3100 485.0327 520.9906 611.0607 682.4587 746.4607 760.5887 802.2227 819.9488 834.2628 852.9463 858.9008 885.1959 903.1575 930.0939 955.9937 969.3647 987.3330 1022.5146 1037.3767 1061.3747 1073.9072 1083.5346 1101.6144 1107.6397 1121.5103 1140.6572 1150.7283 1152.1816 1219.1186 1221.3862 1236.1095 1255.8732 1260.5816 1269.5745 1284.2448 1293.4680 1295.0338 1310.1809 1333.0236 1336.2247 1341.0101 1344.1742 1348.8896 1356.1025 1356.2872 1385.9926 1434.5071 1450.5150 1458.4400 1460.0770 1465.9680 1467.6410 1471.3697 1479.8883 1483.8730 1632.1612 2831.7853 2846.1951 2879.9410 2968.4355 2979.2478 2982.8883 2984.4557 2986.5712 2991.9642 2997.4773 3025.6325 3034.9769 3040.1052 3041.5491 3043.6367 3049.7602 3053.7064 3057.2546 3083.0868
redmass: 3.0992 3.6275 5.6253 2.7942 2.9909 1.8482 2.1228 2.5944 2.5877 4.3611 2.1047 1.8339 3.4489 3.0111 2.3227 2.4388 2.1865 2.4773 2.9951 2.8041 2.7102 1.4753 1.9470 2.6114 1.6412 1.9423 2.4226 1.9145 1.8395 1.3228 2.6563 2.4471 2.0535 1.9462 1.8776 1.4931 1.5221 1.5055 2.9636 2.6530 1.7607 1.6846 1.3652 1.7162 1.6094 1.5933 1.2720 1.4005 1.1683 1.3558 1.2796 1.4356 1.3921 1.2982 1.4395 1.4256 1.4268 1.5058 1.4305 1.4139 1.4040 1.1032 1.0897 1.0856 1.0865 1.0906 1.0835 1.0865 1.0953 1.0856 9.2039 1.0715 1.0709 1.0815 1.0627 1.0612 1.0611 1.0616 1.0635 1.0635 1.0605 1.0879 1.0955 1.0992 1.0957 1.1014 1.0915 1.1026 1.1022 1.1023
irintensity: 1.0362 1.4430 3.8552 0.1901 0.4434 0.4429 0.5035 1.2013 2.1091 4.5961 0.2192 1.3792 3.3134 0.1438 4.9672 6.5208 2.6080 0.0308 2.7633 7.4323 10.8626 0.0520 0.9488 1.4473 6.5065 1.3331 9.4990 4.5886 2.6273 2.8427 12.5973 23.8180 5.9520 6.5405 4.5381 16.3972 5.5670 16.0161 16.8703 5.9724 4.1439 8.3475 6.0255 14.8471 3.6298 8.0164 9.4279 10.9395 10.3903 6.8047 0.6243 14.9304 16.8371 1.7942 3.9520 0.7586 0.3083 3.0798 1.4019 3.6785 0.3248 16.2539 6.8357 2.8158 20.1847 9.1741 6.4459 9.7286 5.4904 17.2012 147.2256 56.0736 95.6287 90.9164 38.4248 36.7707 31.2601 29.3572 34.1684 32.8275 12.8468 50.0945 60.6419 32.8774 7.6243 44.8763 46.8858 89.3434 54.9602 27.6549
temp: 298.150 k
press: 1.00000 atm
elementType: 8 7 6 6 6 6 6 6 6 6 6 6 6 1 1 1 1 1 1 1 1 1 1 1 1 1 1 1 1 1 1 1
symmnumber: 1
zpe: 746336.6 jmol-1
zpe.correction: 0.284265 hartree
zpe.thermalcorrener: 0.296582 hartree
zpe.thermalcorrenthalpy: 0.297526 hartree
zpe.thermalcorrgfe: 0.245738 hartree
zpe.sumelectzpe: -559.492915 hartree
zpe.sumelectthermal: -559.480598 hartree
zpe.sumelectthermalent: -559.479654 hartree
zpe.sumelectthermalfe: -559.531443 hartree
dipole: 1.6333 -2.7728 0.9627
dipole: 3.3590
quadrupole: -79.6943 -85.3161 -80.0815
quadrupole: 7.3525 -3.8431 4.5991
quadrupole: 2.0030 -3.6188 1.6158 7.3525 -3.8431 4.5991
hfenergy: -559.7771801 hartree
pointgroup: C01 [X(C11H19N1O1)]
dipole: -0.6161494 -1.0865177 -0.4315817 debye
polarizability: 135.0740619|1.2320641|121.2329648|0.9634308|1.6517917|107.4833873 unknown
InChI: InChI=1S/C11H19NO/c13-11-7-3-2-6-10(11)12-8-4-1-5-9-12/h10H,1-9H2
charge 0 multiplicity 1
32 atoms
O  2.020646 2.047821 1.032578
N  -0.585999 -0.100922 0.163384
C  0.658484 0.005645 0.985886
C  1.482936 -1.317673 1.02478
C  -1.495757 -1.19221 0.605785
C  -1.306268 1.205523 0.133624
C  -2.721927 -1.307458 -0.325117
C  -2.518937 1.161712 -0.814725
C  1.947504 -1.743275 -0.387252
C  -3.489269 0.030304 -0.408731
C  1.605721 1.059262 0.370404
C  2.815403 -0.640495 -1.038525
C  2.080288 0.737282 -1.039617
H  0.431123 0.328491 2.032398
H  0.904405 -2.120934 1.516257
H  2.36821 -1.138681 1.668356
H  -1.844806 -1.019611 1.658575
H  -0.945082 -2.148355 0.594294
H  -0.601345 1.99121 -0.195364
H  -1.648243 1.491227 1.162944
H  -3.382238 -2.116071 0.043612
H  -2.372634 -1.596114 -1.335862
H  -2.16012 0.989212 -1.848288
H  -3.030784 2.142907 -0.797886
H  1.061139 -1.93493 -1.021256
H  2.523173 -2.686778 -0.324538
H  -4.326016 -0.045619 -1.128493
H  -3.932997 0.263631 0.581468
H  3.076048 -0.914679 -2.078079
H  3.767785 -0.539144 -0.480412
H  1.192977 0.656347 -1.696091
H  2.73828 1.545473 -1.401708
