program: Gaussian 09
title: 000102188
version: EM64L-G09RevD.01
frameworkgroup: C1[X(C18H22N2O)]
method: RPBEPBE
basis: SDD
operation: Freq
keyword: #p
keyword: freq=noraman
keyword: PBEPBE/SDD
title: #p freq=noraman PBEPBE/SDD
converged: NO YES NO NO
title: Mulliken charges:
elementType: O N N C C C C C C C C C C C C C C C C C C H H H H H H H H H H H H H H H H H H H H H H
charge: -0.289671 -0.147151 -0.074967 -0.145900 -0.147911 -0.438494 -0.439997 -0.390796 -0.395628 0.206391 -0.399260 -0.472789 0.046950 -0.674312 -0.133792 0.354433 -0.396623 -0.399026 -0.221928 -0.221100 -0.245591 0.283239 0.241709 0.218101 0.228184 0.226545 0.218398 0.214879 0.239322 0.224457 0.192390 0.220889 0.232902 0.221979 0.219585 0.201735 0.228407 0.234852 0.246121 0.244796 0.228845 0.229200 0.230627
chargesum: 0.00000
title: Mulliken charges with hydrogens summed into heavy atoms:
elementType: O N N C C C C C C C C C C C C C C C C C C
charge: -0.289671 -0.147151 -0.074967 0.137340 0.093798 0.007791 0.004946 0.063405 0.021219 0.206391 0.054530 -0.031226 0.046950 -0.009318 -0.133792 0.354433 -0.150502 -0.154230 0.006917 0.008100 -0.014964
polarizability: 3.09969467e+02 -2.41145107e+01 1.86590369e+02 -3.05853984e+00 -1.64300948e+00 1.47379137e+02
1716.lowfreq: -14.6060 -9.3549 -5.1183 -2.7638 -0.0006 -0.0006 0.0005 17.2027 19.9569
frequency: -14.0354 16.9104 19.6120 32.6299 46.8123 82.3978 90.4703 100.1196 138.9503 151.0266 174.2213 188.6243 244.3959 248.3568 270.6978 283.5402 297.8089 328.3451 341.6208 382.4652 389.2709 401.0512 468.2081 483.3959 501.0102 508.2995 533.2185 538.0138 562.0920 617.0230 622.9499 690.0598 697.6782 717.1920 750.0492 762.8691 773.3721 796.3379 803.7879 837.9837 853.3655 856.4709 904.4212 917.7220 925.6344 930.3088 959.5276 966.4323 978.4909 985.8655 990.9694 997.0633 1013.6165 1020.8626 1022.5766 1031.8132 1044.0924 1074.0005 1078.5719 1082.9483 1089.2284 1121.2871 1125.3335 1156.7936 1166.8830 1172.9442 1187.3857 1194.7697 1205.5356 1224.6812 1244.1449 1251.6351 1262.0601 1267.5872 1274.9736 1288.2897 1291.0849 1301.4516 1311.8675 1317.3781 1329.3773 1332.8019 1349.9564 1368.2081 1378.3653 1394.4574 1412.4307 1432.8517 1449.5956 1450.8064 1455.4550 1464.6760 1465.0803 1472.1624 1475.2924 1479.4298 1482.2539 1575.1016 1583.4116 1609.4961 2267.1324 2821.0285 2842.1498 2880.1262 2966.8270 2985.3166 2996.9272 3010.2039 3013.6016 3016.7787 3028.4306 3041.5092 3074.8436 3080.1190 3092.2082 3092.9809 3100.8265 3105.9358 3127.6000 3135.6735 3148.8772 3157.6833 3169.3966
redmass: 3.7307 4.6250 4.6704 4.5763 3.0823 4.2224 2.6799 3.3625 3.3666 3.2628 1.9497 1.2453 3.6982 3.7483 4.2423 3.4847 4.0567 2.3754 2.4395 4.7358 4.1702 2.8405 3.4164 3.6811 5.3931 4.1549 4.4082 3.5700 3.9151 5.7335 3.8341 3.3086 1.8454 5.4217 4.7398 4.8692 1.7451 1.5464 1.3395 2.8554 1.2475 2.5920 2.7993 3.1045 1.4462 1.7870 1.8089 3.5987 1.3823 4.5789 2.9829 1.3187 1.6077 1.9658 2.2065 1.9965 1.8542 1.5784 1.6052 2.0153 2.6410 2.1367 2.5926 1.7771 1.4317 1.0548 1.1124 1.3096 1.4008 1.3907 1.3822 1.1946 1.3797 1.5054 2.3748 1.6918 1.5409 1.4397 1.3975 1.4886 1.6565 1.4668 1.4473 5.3642 1.4808 1.2287 3.7169 2.3612 1.1089 1.0825 1.0823 1.0450 1.0755 1.1035 1.0975 1.0562 2.4024 5.7580 8.2688 6.0710 11.8731 1.0705 1.0698 1.0698 1.0596 1.0844 1.0368 1.0873 1.0621 1.0994 1.0627 1.0898 1.0935 1.0963 1.0996 1.0899 1.1037 1.1001 1.0846 1.0880 1.0928 1.0970 1.1017
irintensity: 0.1422 0.3178 0.0708 0.7390 0.9607 0.2827 3.1357 3.7326 0.3426 3.9537 0.5627 0.9288 2.5166 1.7453 4.5025 10.0432 1.4013 2.8873 6.2688 0.3151 4.1072 0.0078 1.1762 0.6779 2.9471 5.5482 1.3993 10.2350 3.7815 0.5085 1.5801 0.6817 42.6234 2.6434 2.5597 2.9282 67.1758 5.7769 16.1009 19.8398 0.0252 8.9116 1.2241 9.1569 6.1815 2.5043 9.5430 6.1815 0.0049 2.5887 11.7920 0.1796 8.7675 15.6164 17.0238 31.5360 1.7789 0.5151 8.7979 10.1769 7.9592 26.8856 39.3395 2.9537 11.6987 0.0167 0.1426 10.1585 23.5388 12.0679 14.4948 0.6622 6.5858 16.4682 2.8620 68.5371 9.3201 0.3673 0.0625 18.4300 12.9495 11.8673 19.7601 0.0410 29.8410 13.8517 237.0967 5.9212 29.7369 3.5984 0.6491 8.0752 9.9373 26.3509 0.4737 19.6738 37.9585 2.0551 316.8774 15.4988 0.6917 55.4733 127.7310 80.6824 32.1130 16.6953 38.8538 26.1380 36.8402 16.4485 50.1709 24.4076 26.6105 9.0244 33.4417 10.4418 50.7410 31.9388 1.9342 2.6732 21.1131 33.5785 17.9529
temp: 298.150 k
press: 1.00000 atm
elementType: 8 7 7 6 6 6 6 6 6 6 6 6 6 6 6 6 6 6 6 6 6 1 1 1 1 1 1 1 1 1 1 1 1 1 1 1 1 1 1 1 1 1 1
symmnumber: 1
zpe: 945649.9 jmol-1
zpe.correction: 0.360179 hartree
zpe.thermalcorrener: 0.379188 hartree
zpe.thermalcorrenthalpy: 0.380132 hartree
zpe.thermalcorrgfe: 0.310221 hartree
zpe.sumelectzpe: -882.231421 hartree
zpe.sumelectthermal: -882.212412 hartree
zpe.sumelectthermalent: -882.211468 hartree
zpe.sumelectthermalfe: -882.281379 hartree
dipole: 1.1676 2.4791 2.8828
dipole: 3.9774
quadrupole: -116.5563 -117.4946 -133.0260
quadrupole: -12.9422 -15.7145 -5.8796
quadrupole: 5.8026 4.8644 -10.6670 -12.9422 -15.7145 -5.8796
hfenergy: -882.5915998 hartree
pointgroup: C01 [X(C18H22N2O1)]
dipole: 0.4385815 1.235789 0.8539095 debye
polarizability: 309.6485326|-23.9009061|183.1720879|7.3965845|-11.8714819|151.1183521 unknown
InChI: InChI=1S/C18H22N2O/c1-2-18(21)20-16-10-11-17(20)14-19(13-16)12-6-9-15-7-4-3-5-8-15/h3-5,7-8,16-17H,2,10-14H2,1H3
charge 0 multiplicity 1
43 atoms
O  -4.194128 -1.698748 -1.493041
N  -3.280402 -0.381208 0.17822
N  -0.758141 0.986529 0.254283
C  -2.018016 -1.150046 0.325335
C  -3.096516 0.796308 1.061317
C  -1.818787 -1.157629 1.869867
C  -2.535646 0.146739 2.363802
C  -0.903553 -0.34654 -0.39101
C  -2.041839 1.717925 0.388816
C  -4.276882 -0.680889 -0.733109
C  0.300266 1.827487 -0.357071
C  -5.486616 0.271412 -0.757069
C  1.645248 1.231869 -0.264343
C  -6.592137 -0.220365 -1.708376
C  2.785999 0.759742 -0.206067
C  4.104136 0.191947 -0.138649
C  5.22326 0.885411 -0.685298
C  4.316187 -1.076676 0.476378
C  6.514583 0.323253 -0.61758
C  5.610327 -1.632919 0.538802
C  6.715004 -0.937247 -0.006702
H  -2.133309 -2.144149 -0.13262
H  -4.037086 1.347562 1.216134
H  -0.747544 -1.152607 2.130011
H  -2.285998 -2.057022 2.307045
H  -3.362774 -0.090803 3.055659
H  -1.833687 0.827491 2.873244
H  -1.164239 -0.265355 -1.475348
H  0.064192 -0.873525 -0.311963
H  -1.871404 2.616601 1.012742
H  -2.450253 2.057672 -0.598709
H  0.083448 2.049098 -1.435757
H  0.300797 2.804325 0.167914
H  -5.886871 0.381151 0.270959
H  -5.141651 1.280458 -1.063456
H  -7.428026 0.502204 -1.738227
H  -6.982134 -1.200019 -1.384243
H  -6.196846 -0.352694 -2.729263
H  5.067149 1.860137 -1.159496
H  3.461093 -1.613367 0.900964
H  7.365845 0.8670 -1.042251
H  5.758686 -2.609087 1.013753
H  7.719366 -1.371926 0.043504
