program: Gaussian 09
title: 000102175
version: EM64L-G09RevD.01
frameworkgroup: C1[X(C11H15N5O4)]
method: RPBEPBE
basis: SDD
operation: Freq
keyword: #p
keyword: freq=noraman
keyword: PBEPBE/SDD
title: #p freq=noraman PBEPBE/SDD
converged: YES YES NO NO
title: Mulliken charges:
elementType: O O O O N N N N N C C C C C C C C C C C H H H H H H H H H H H H H H H
charge: -0.294341 -0.423875 -0.484620 -0.433347 -0.165074 -0.087560 -0.046496 -0.063236 -0.360943 -0.168669 -0.047445 -0.180221 -0.084899 -0.317428 0.171300 -0.212406 -0.113990 0.186203 -0.373966 -0.601565 0.266893 0.283846 0.240139 0.253726 0.218062 0.183059 0.373872 0.365577 0.266033 0.363358 0.242241 0.336239 0.250348 0.250181 0.209005
chargesum: 0.00000
title: Mulliken charges with hydrogens summed into heavy atoms:
elementType: O O O O N N N N N C C C C C C C C C C C
charge: -0.294341 -0.050003 -0.119043 -0.069990 -0.165074 -0.087560 -0.046496 -0.063236 -0.024704 0.098224 0.236400 0.059918 0.168827 0.083693 0.171300 0.053627 -0.113990 0.186203 -0.131725 0.107970
polarizability: 2.44588098e+02 9.98026174e-01 1.49423691e+02 -1.11588356e+00 2.27218831e+01 1.15989354e+02
1716.lowfreq: -24.1544 -10.5843 -3.6215 -0.0011 -0.0010 -0.0007 3.1612 23.5786 28.2400
frequency: -24.0780 23.5410 28.2047 46.2766 60.6555 99.4370 107.0425 108.0562 155.9612 168.0840 190.6144 204.1187 208.5200 238.8732 261.6013 280.4007 307.4203 324.8919 341.1389 359.6998 407.1341 484.0661 496.5658 497.4450 517.8838 540.8114 550.8035 565.2625 599.9819 617.8503 645.2146 651.8242 668.1160 696.8713 718.1847 786.7994 804.6375 815.6588 825.3321 848.1823 870.8881 925.1110 930.3616 955.9126 964.4410 976.3053 1007.7727 1042.8379 1051.1562 1061.1643 1074.4181 1082.2353 1099.7305 1123.0091 1135.6611 1153.3880 1176.4367 1180.7643 1217.3055 1220.7094 1244.9178 1252.0246 1264.1312 1273.5698 1294.7985 1306.0811 1313.7920 1325.6887 1336.2539 1355.4165 1361.7357 1374.6183 1377.7934 1388.7235 1403.8308 1421.2122 1430.7613 1452.9970 1455.4337 1461.9628 1481.4954 1504.2280 1546.9667 1621.3031 2935.2260 2989.4886 3008.4723 3022.6161 3029.1227 3060.0842 3064.6195 3069.3648 3108.2459 3163.4522 3234.8243 3494.2327 3526.7095 3571.0704 3610.3417
redmass: 1.0202 6.0685 6.3097 5.1001 5.3818 4.2456 3.4494 4.7016 4.9261 4.3577 4.3979 6.9655 1.1881 5.8095 4.7244 5.1047 4.3007 5.3498 4.4657 5.7041 4.1396 1.1834 7.6256 1.2165 2.6420 1.2208 5.3252 3.3954 5.2817 5.9215 5.0336 5.9551 7.6711 4.7076 5.3655 3.0356 3.6869 2.4109 4.5846 7.2266 3.2994 5.3942 1.4670 3.0050 5.1418 2.9917 3.4254 2.4137 2.6879 4.5927 2.1261 3.3527 3.1363 1.2835 3.7127 1.3678 2.2004 1.1989 1.4576 1.7717 1.3919 1.2683 1.9077 1.4360 1.8820 3.3845 4.5236 1.7706 1.2594 1.5516 1.9263 1.3350 2.2536 1.2630 1.4559 1.8591 2.1549 1.5936 1.0446 1.0955 1.6762 1.7704 6.8576 6.2420 1.0691 1.0340 1.0867 1.0856 1.0864 1.0870 1.0940 1.1012 1.1013 1.0919 1.0981 1.0645 1.0653 1.0779 1.0671
irintensity: 0.0537 0.3994 0.4738 4.4122 6.1560 4.1456 4.1547 2.0810 0.5682 0.7072 3.5236 5.8953 155.9831 0.8131 10.5042 2.7076 7.9866 5.0114 6.8170 1.4853 0.3144 156.7248 7.4818 133.0081 2.1502 95.5999 15.8071 3.6126 36.5800 18.7486 21.3400 5.7030 3.2601 44.6243 1.0328 22.4996 18.6216 2.2728 29.6196 6.3567 40.8287 217.1817 21.6038 21.5492 46.5691 57.9975 88.7950 34.6972 42.4509 72.6993 6.9746 24.2628 9.6673 1.5988 10.0471 39.2032 8.4742 23.8746 21.9113 105.9509 8.8179 7.5888 31.8446 35.9922 48.3642 18.2745 63.3104 20.4953 9.2061 38.7244 69.2658 41.7339 47.2929 35.5182 3.6860 108.4866 20.3527 34.4761 13.5121 7.1841 18.6650 14.3439 69.0687 627.3545 60.9170 75.9302 34.7360 27.5542 5.6672 18.4085 52.9141 28.1419 23.1087 18.3309 0.0593 42.8241 14.7732 69.1696 21.9878
temp: 298.150 k
press: 1.00000 atm
elementType: 8 8 8 8 7 7 7 7 7 6 6 6 6 6 6 6 6 6 6 6 1 1 1 1 1 1 1 1 1 1 1 1 1 1 1
symmnumber: 1
zpe: 709627.0 jmol-1
zpe.correction: 0.270283 hartree
zpe.thermalcorrener: 0.288472 hartree
zpe.thermalcorrenthalpy: 0.289416 hartree
zpe.thermalcorrgfe: 0.222485 hartree
zpe.sumelectzpe: -1001.289904 hartree
zpe.sumelectthermal: -1001.271715 hartree
zpe.sumelectthermalent: -1001.270771 hartree
zpe.sumelectthermalfe: -1001.337702 hartree
dipole: -2.9957 -0.1195 1.3480
dipole: 3.2872
quadrupole: -82.7356 -125.6745 -123.6438
quadrupole: 19.8298 0.5895 7.3856
quadrupole: 27.9491 -14.9899 -12.9592 19.8298 0.5895 7.3856
hfenergy: -1001.5601866 hartree
pointgroup: C01 [X(C11H15N5O4)]
dipole: 1.172183 0.0584374 0.5432906 debye
polarizability: 244.4548135|3.2415389|150.7148758|2.9297593|-21.7230677|114.8314539 unknown
InChI: InChI=1S/C11H15N5O4/c1-12-9-6-10(14-3-13-9)16(4-15-6)11-8(19)7(18)5(2-17)20-11/h3-5,7-8,11-12,17-19H,2H2,1H3
charge 0 multiplicity 1
35 atoms
O  2.161045 -0.517683 -0.877064
O  1.84275 2.060498 1.760026
O  3.752448 2.16174 -0.074445
O  3.87828 -2.712744 -0.979612
N  0.054399 -0.145554 0.188709
N  -1.531225 -1.587903 1.009912
N  -1.437225 1.450472 -1.006553
N  -3.812141 0.836066 -0.782187
N  -4.529481 -1.067674 0.442325
C  2.207453 0.817891 1.127956
C  1.336663 0.454853 -0.113245
C  3.637635 0.822472 0.526594
C  3.604532 -0.307137 -0.523708
C  4.134242 -1.656199 -0.007259
C  -1.187515 0.34515 -0.24873
C  -0.219392 -1.307023 0.935432
C  -2.147755 -0.555032 0.275547
C  -3.517504 -0.270856 -0.017591
C  -2.776589 1.615135 -1.225354
C  -5.944657 -0.804162 0.161999
H  2.113368 0.036186 1.900637
H  1.135907 1.353728 -0.726011
H  4.42037 0.669947 1.295032
H  4.130073 -0.024404 -1.455089
H  5.230825 -1.624174 0.117687
H  3.668047 -1.893101 0.975688
H  2.229236 2.791865 1.205448
H  4.656242 2.309369 -0.44374
H  0.567736 -1.916582 1.372451
H  2.926154 -2.636369 -1.253957
H  -3.062254 2.481637 -1.829345
H  -4.256137 -1.87494 1.004081
H  -6.139299 -0.80184 -0.925233
H  -6.249829 0.181948 0.555136
H  -6.554403 -1.589179 0.638464
