program: Gaussian 09
title: 000100131
version: EM64L-G09RevD.01
frameworkgroup: C1[X(C11H21N3O4)]
method: RPBEPBE
basis: SDD
operation: Freq
keyword: #p
keyword: freq=noraman
keyword: PBEPBE/SDD
title: #p freq=noraman PBEPBE/SDD
converged: YES YES NO NO
title: Mulliken charges:
elementType: O O O O N N N C C C C C C C C C C C H H H H H H H H H H H H H H H H H H H H H
charge: -0.426247 -0.271517 -0.224689 -0.317995 -0.401730 -0.366790 -0.535613 -0.425717 -0.017116 -0.122565 -0.710911 -0.716897 -0.198929 0.227369 0.131560 -0.728322 0.257289 -0.512778 0.240136 0.234867 0.194049 0.279025 0.389268 0.212741 0.233507 0.200372 0.218429 0.232442 0.211489 0.270767 0.235360 0.245305 0.220432 0.309882 0.387281 0.216885 0.251025 0.293067 0.285270
chargesum: 0.00000
title: Mulliken charges with hydrogens summed into heavy atoms:
elementType: O O O O N N N C C C C C C C C C C C
charge: -0.038966 -0.271517 -0.224689 -0.317995 -0.012463 -0.056909 0.042724 0.049286 0.176933 0.156460 -0.064290 -0.054537 0.071838 0.227369 0.131560 -0.027226 0.257289 -0.044867
polarizability: 1.65975797e+02 4.09906899e+00 1.55509463e+02 4.31179839e+00 1.01712543e+01 1.32820388e+02
1716.lowfreq: -16.2249 -6.4642 -0.0006 -0.0005 0.0001 3.4957 14.2221 15.4222 49.4942
frequency: 9.7350 13.7581 49.4279 54.4141 57.6738 68.1240 80.5409 92.7036 114.5908 125.7414 155.9637 174.2569 186.6300 195.5104 224.5345 243.1792 260.2126 262.7594 277.8251 283.7313 303.4205 327.7024 347.7676 377.3522 379.9211 411.9940 438.7369 514.1780 531.0608 541.3806 563.3250 576.3234 627.4039 652.8577 668.8833 709.8944 737.7165 741.6317 757.9233 760.2757 809.3370 862.8967 882.6389 895.4928 897.9046 919.0792 933.6423 942.5726 964.4738 1009.8221 1032.1826 1057.5581 1079.0677 1116.4849 1122.8654 1126.5203 1130.9123 1155.2161 1165.8127 1205.1524 1221.3035 1232.1740 1234.3360 1265.7584 1295.9912 1307.7974 1312.1139 1321.6181 1331.8146 1337.5280 1348.3539 1352.2621 1369.0105 1379.7692 1395.1803 1397.5332 1433.5964 1454.7521 1457.8290 1466.5423 1467.9390 1478.5455 1480.0645 1483.1232 1493.6965 1499.0234 1587.0200 1617.3656 1659.3429 1662.0763 2951.5027 2968.3155 2974.6625 2975.1802 2981.4989 2997.6598 2998.7334 3012.9537 3040.4093 3052.5824 3056.7461 3064.8993 3078.5505 3086.4180 3097.2628 3109.6843 3378.2465 3447.3855 3520.7460 3534.0786 3567.7311
redmass: 3.6836 3.5220 2.7401 6.3613 4.2015 7.0321 4.1354 6.2851 3.9301 4.7052 2.7176 2.2644 3.6499 1.2821 1.3684 2.2535 1.1426 1.7405 2.8368 4.4715 2.9982 3.9923 2.6152 1.9452 2.5697 4.3216 3.2832 3.4551 2.7918 2.2855 2.6637 1.5651 3.7452 1.5382 1.8127 3.9589 3.8855 2.7484 3.9194 1.2576 3.1092 2.1471 1.7593 2.5474 3.6419 1.4065 1.8881 2.2540 1.6232 2.2902 1.7771 2.0284 2.0594 2.3011 2.3300 1.7139 2.1151 2.1407 2.5829 2.0631 2.0271 1.3024 1.6427 1.2706 1.3986 1.7524 1.6463 1.3391 1.3110 1.4383 1.3251 1.5576 1.2882 1.2107 1.2249 1.2130 1.0933 1.0815 1.0982 1.0938 1.4081 1.1931 1.0803 1.0845 1.1450 1.6104 6.4105 5.9659 1.0819 8.9331 1.0812 1.0369 1.0694 1.0447 1.0601 1.0630 1.0367 1.0845 1.1021 1.1015 1.0997 1.0989 1.1000 1.0984 1.1010 1.0987 1.0821 1.0454 1.0642 1.0778 1.0963
irintensity: 0.2677 0.0382 0.6220 3.3746 3.4695 1.8028 5.0583 7.0532 3.3080 4.4416 2.7500 0.8912 1.1863 0.6102 3.6247 32.2056 0.4260 37.1373 6.5392 1.8255 32.7333 12.3317 0.0853 0.5830 3.5729 6.0742 3.9954 36.2389 49.2290 49.8132 16.7858 30.2055 15.4283 199.6808 168.6953 2.3825 80.1698 176.5882 6.2569 51.4902 7.9964 18.9178 1.6470 6.4374 5.4328 7.8317 0.4557 37.3834 6.5049 18.9003 3.8800 114.3950 46.3987 6.5732 16.0631 7.9433 9.7302 17.1584 15.2990 7.8735 22.8120 8.6080 20.7573 3.0782 12.7889 14.7430 4.6499 7.2583 15.1639 9.7681 5.9092 4.0140 1.2373 14.0178 32.8555 21.1722 14.5736 11.2513 28.8179 29.4693 70.9165 35.6257 14.5531 28.1610 81.7273 251.4504 50.9235 239.1384 33.4440 203.1616 23.6395 32.1570 28.7069 13.6679 27.8253 29.1719 19.7729 5.2368 19.8650 10.3361 32.6657 53.9932 26.0247 36.4719 20.8907 17.1757 145.8137 1.8386 31.2209 20.8005 4.0468
temp: 298.150 k
press: 1.00000 atm
elementType: 8 8 8 8 7 7 7 6 6 6 6 6 6 6 6 6 6 6 1 1 1 1 1 1 1 1 1 1 1 1 1 1 1 1 1 1 1 1 1
symmnumber: 1
zpe: 852036.6 jmol-1
zpe.correction: 0.324524 hartree
zpe.thermalcorrener: 0.345874 hartree
zpe.thermalcorrenthalpy: 0.346818 hartree
zpe.thermalcorrgfe: 0.271602 hartree
zpe.sumelectzpe: -895.518148 hartree
zpe.sumelectthermal: -895.496797 hartree
zpe.sumelectthermalent: -895.495853 hartree
zpe.sumelectthermalfe: -895.571069 hartree
dipole: -2.7390 0.8829 0.2376
dipole: 2.8876
quadrupole: -109.9039 -117.3819 -106.0893
quadrupole: 12.0456 4.9287 -6.2772
quadrupole: 1.2211 -6.2569 5.0357 12.0456 4.9287 -6.2772
hfenergy: -895.8426713 hartree
pointgroup: C01 [X(C11H21N3O4)]
dipole: -1.1086889 -0.1355505 -0.20761 debye
polarizability: 164.7255578|-5.9365187|151.109261|-1.9006539|14.6579729|138.4708296 unknown
InChI: InChI=1S/C11H21N3O4/c1-6(2)4-8(11(17)18)14-10(16)7(3)13-9(15)5-12/h6-8,13-14,17H,4-5,12H2,1-3H3
charge 0 multiplicity 1
39 atoms
O  2.374238 0.445889 -2.270679
O  0.315299 2.22848 1.620071
O  4.261043 0.220714 -0.937301
O  -1.438373 -0.087183 -1.957931
N  0.718359 0.930443 -0.27238
N  -2.358116 0.936245 -0.089567
N  -3.050227 -2.4599 -1.432945
C  2.228198 -0.54614 1.205435
C  1.750469 -1.987362 0.864752
C  2.086511 0.604104 0.149878
C  0.210251 -2.128651 0.77965
C  2.424006 -2.591653 -0.391218
C  -1.446191 2.106023 -0.13058
C  -0.062051 1.759852 0.499372
C  3.028667 0.401744 -1.032404
C  -2.085589 3.307344 0.577526
C  -2.325109 -0.060374 -1.038607
C  -3.440294 -1.131659 -0.95347
H  1.692866 -0.193399 2.107117
H  3.305468 -0.583888 1.460117
H  2.080554 -2.594047 1.735835
H  2.466428 1.501348 0.68307
H  0.33663 0.569633 -1.161073
H  -0.281962 -1.676081 1.660881
H  -0.185508 -1.639205 -0.126674
H  -0.070869 -3.199362 0.7426
H  2.071295 -2.094727 -1.314492
H  3.524341 -2.500011 -0.348705
H  2.172384 -3.664784 -0.482411
H  -1.279401 2.325523 -1.202555
H  -2.204505 3.10978 1.657295
H  -1.432497 4.190366 0.487062
H  -3.066269 3.543908 0.128293
H  -3.027722 0.883915 0.681684
H  3.037235 0.310133 -3.00038
H  -3.813457 -1.213027 0.085502
H  -4.289297 -0.768754 -1.565928
H  -2.71229 -2.439626 -2.401844
H  -2.370415 -2.927708 -0.822696
