program: Gaussian 09
title: 000100130
version: EM64L-G09RevD.01
frameworkgroup: C1[X(C10H16N2O7)]
method: RPBEPBE
basis: SDD
operation: Freq
keyword: #p
keyword: freq=noraman
keyword: PBEPBE/SDD
title: #p freq=noraman PBEPBE/SDD
converged: YES YES NO NO
title: Mulliken charges:
elementType: O O O O O O O N N C C C C C C C C C C H H H H H H H H H H H H H H H H
charge: -0.276816 -0.405000 -0.222859 -0.491190 -0.446569 -0.199213 -0.283652 -0.396369 -0.565283 -0.153153 -0.265816 -0.409755 -0.374900 0.209449 -0.492385 -0.508782 0.143461 0.220549 0.207409 0.316142 0.262310 0.256737 0.258936 0.213250 0.240873 0.338823 0.259692 0.268038 0.271635 0.254655 0.280967 0.270943 0.388100 0.402312 0.427461
chargesum: 0.00000
title: Mulliken charges with hydrogens summed into heavy atoms:
elementType: O O O O O O O N N C C C C C C C C C C
charge: -0.276816 -0.016900 -0.222859 -0.088877 -0.019109 -0.199213 -0.283652 -0.057546 -0.013374 0.162989 -0.003505 0.105919 0.079223 0.209449 0.035344 0.017507 0.143461 0.220549 0.207409
polarizability: 1.75012912e+02 1.26659610e+00 1.38298909e+02 1.17523603e+00 -5.47019128e+00 1.16706412e+02
1716.lowfreq: -6.3725 -0.0010 -0.0007 -0.0005 3.3552 13.1513 21.2293 32.1302 41.3169
frequency: 21.0079 32.0051 41.3098 56.3560 61.1609 78.3695 88.7690 93.5922 104.1719 129.7751 134.9888 150.7234 178.0996 195.0965 198.5274 238.1121 252.7976 256.5507 302.2647 328.6932 351.0316 392.3868 416.6280 460.0535 512.3295 529.8008 539.5017 548.1012 566.0862 590.0079 594.7835 609.8435 625.4314 658.3642 680.4891 704.5967 726.5230 732.2708 766.3304 791.6094 799.0654 832.2015 865.7865 867.0347 909.0969 936.3974 962.6749 1008.6285 1029.6262 1035.5924 1051.8632 1064.8154 1082.0836 1111.3129 1127.3859 1133.7137 1173.0582 1193.2951 1210.6149 1215.3328 1236.5027 1254.6329 1261.1091 1262.1521 1302.1375 1307.7302 1312.0699 1321.6376 1338.0565 1345.3832 1358.7129 1376.3116 1385.5699 1438.9959 1451.2095 1462.5916 1473.6218 1492.3566 1610.1071 1632.9866 1646.5499 1661.0446 1695.7978 2998.2031 3011.6994 3012.3816 3019.5047 3029.5926 3035.1926 3049.8212 3075.8085 3081.7806 3097.0969 3195.7709 3431.2752 3514.0596 3525.9780 3546.0725 3559.2677
redmass: 9.9157 7.0534 11.4032 6.5064 6.9612 7.6381 5.5714 5.7292 4.5290 4.7453 6.3730 3.3891 4.3768 3.1485 5.8569 3.2778 2.6843 3.8173 1.4298 3.4521 4.2007 4.8408 2.9603 3.4516 3.3368 2.5183 3.6400 2.7206 2.0920 2.0338 1.8782 1.9675 1.5324 1.8364 3.4666 2.3873 4.6690 6.6839 1.7372 2.2561 3.1531 3.6769 2.3485 1.3506 3.3393 2.6028 2.1041 2.4456 3.2876 2.7138 2.8270 2.8929 1.9546 2.8367 2.4579 1.8952 1.8738 1.3483 1.2494 1.7704 1.3987 1.4088 1.5674 1.3852 1.2398 1.3909 1.3674 1.5093 1.3603 1.4897 1.4873 1.4149 1.7926 1.0898 1.0884 1.0921 1.1398 1.7554 5.4199 5.8576 1.1184 8.8091 8.3894 1.0616 1.0602 1.0628 1.0618 1.0793 1.0861 1.0976 1.1040 1.1011 1.1056 1.0681 1.0451 1.0643 1.0641 1.0773 1.0968
irintensity: 1.2870 5.7163 1.0076 1.5727 1.3263 0.1769 0.6539 1.7069 0.7474 4.5966 4.1450 13.0475 2.2598 4.9775 6.6624 5.8981 38.2389 3.4340 50.9570 9.7530 1.1419 16.0854 1.0389 8.5427 27.3188 21.8308 12.1472 77.4090 8.0842 43.2180 112.8598 96.6117 126.6389 122.6638 35.2866 139.9268 48.7915 7.6409 9.4233 2.7506 16.5587 102.9454 55.4498 120.6172 10.4338 5.0934 0.4790 192.7544 198.4225 27.3360 49.0150 9.5130 55.2113 156.1180 48.8910 44.8931 99.3880 26.9995 26.2415 68.7952 4.0124 5.0686 33.8920 20.8350 5.0328 14.9163 1.3300 33.6795 4.4277 44.4392 41.6142 10.2546 22.2955 49.6477 18.0780 5.8937 27.6028 226.5632 76.7481 230.1019 40.6319 172.9253 283.5876 16.0536 2.9005 16.7331 19.8156 16.8395 11.2594 6.9000 1.6635 21.2718 8.4236 674.9489 1.9317 31.2623 43.5748 26.4868 2.8156
temp: 298.150 k
press: 1.00000 atm
elementType: 8 8 8 8 8 8 8 7 7 6 6 6 6 6 6 6 6 6 6 1 1 1 1 1 1 1 1 1 1 1 1 1 1 1 1
symmnumber: 1
zpe: 712728.5 jmol-1
zpe.correction: 0.271464 hartree
zpe.thermalcorrener: 0.292037 hartree
zpe.thermalcorrenthalpy: 0.292981 hartree
zpe.thermalcorrgfe: 0.220112 hartree
zpe.sumelectzpe: -1025.298453 hartree
zpe.sumelectthermal: -1025.277881 hartree
zpe.sumelectthermalent: -1025.276936 hartree
zpe.sumelectthermalfe: -1025.349805 hartree
dipole: 2.0336 -0.5300 0.2427
dipole: 2.1155
quadrupole: -117.4161 -97.6494 -122.5567
quadrupole: 0.8159 -0.0702 -3.2043
quadrupole: -4.8754 14.8914 -10.0159 0.8159 -0.0702 -3.2043
hfenergy: -1025.5699173 hartree
pointgroup: C01 [X(C10H16N2O7)]
dipole: 0.6659581 0.4950106 -0.0645379 debye
polarizability: 170.3077027|12.3668321|142.4896968|4.0226845|-5.2592256|117.2208333 unknown
InChI: InChI=1S/C10H16N2O7/c11-5(1-3-7(13)14)9(17)12-6(10(18)19)2-4-8(15)16/h5-6,12-13,15,18H,1-4,11H2
charge 0 multiplicity 1
35 atoms
O  -1.285926 -1.958248 -1.577913
O  3.340552 -2.358024 -0.304924
O  2.056139 -2.386922 1.633207
O  1.500447 3.346288 0.219018
O  -0.955511 2.541624 -0.630901
O  3.743152 2.755185 0.228546
O  -1.448254 1.400629 1.32732
N  -0.082347 -1.171356 0.259945
N  -3.311622 -2.609814 0.570461
C  1.221187 -1.219253 -0.394827
C  -2.542584 -1.35546 0.47191
C  1.810935 0.203933 -0.665582
C  -3.463145 -0.24886 -0.122386
C  -1.260221 -1.526921 -0.381847
C  2.031899 1.012264 0.649271
C  -2.753949 0.970285 -0.746794
C  2.2004 -2.04888 0.439227
C  2.558988 2.398877 0.359616
C  -1.693227 1.634511 0.114231
H  1.070037 -1.718374 -1.370666
H  -2.253173 -1.046814 1.492014
H  1.100227 0.736719 -1.322056
H  2.767937 0.092746 -1.205386
H  -4.074945 -0.711484 -0.919727
H  -4.155798 0.059736 0.679525
H  -0.129559 -0.867634 1.235047
H  2.781013 0.504912 1.281747
H  1.084885 1.096136 1.210565
H  -2.266206 0.688831 -1.69864
H  -3.500666 1.743331 -1.014652
H  -3.538003 -2.996629 -0.354699
H  -2.878085 -3.316335 1.175323
H  3.981422 -2.875538 0.254489
H  1.878129 4.242889 0.011712
H  -0.161427 2.916851 -0.127573
