program: Gaussian 09
title: 000100129
version: EM64L-G09RevD.01
frameworkgroup: C1[X(C20H30N2O5)]
method: RPBEPBE
basis: SDD
operation: Freq
keyword: #p
keyword: freq=noraman
keyword: PBEPBE/SDD
title: #p freq=noraman PBEPBE/SDD
converged: YES YES NO NO
title: Mulliken charges:
elementType: O O O O O N N C C C C C C C C C C C C C C C C C C C C H H H H H H H H H H H H H H H H H H H H H H H H H H H H H H
charge: -0.264910 -0.425791 -0.287822 -0.223422 -0.331522 -0.399909 -0.379999 -0.474983 -0.241126 -0.004507 -0.408050 -0.148496 -0.009960 0.210714 -0.713093 -0.721206 -0.726352 -0.720414 0.127219 0.320345 -0.483032 0.489295 -0.370745 -0.387732 -0.212307 -0.224164 -0.248587 0.228725 0.231659 0.282219 0.195155 0.233765 0.234478 0.289130 0.217883 0.385190 0.214994 0.215090 0.210259 0.225583 0.215383 0.209220 0.330209 0.226610 0.208452 0.222454 0.207032 0.217166 0.223352 0.385793 0.223189 0.249210 0.257052 0.235251 0.223569 0.229400 0.233085
chargesum: 0.00000
title: Mulliken charges with hydrogens summed into heavy atoms:
elementType: O O O O O N N C C C C C C C C C C C C C C C C C C C C
charge: -0.264910 -0.039998 -0.287822 -0.223422 -0.331522 -0.014720 -0.049790 -0.014599 0.041093 0.190648 0.060193 0.140634 0.207922 0.210714 -0.072749 -0.071020 -0.068837 -0.072863 0.127219 0.320345 -0.010633 0.489295 -0.113693 -0.152481 0.011261 0.005236 -0.015501
polarizability: 2.75402514e+02 5.59516256e+00 2.56145121e+02 8.94221296e+00 -8.86491575e+00 1.97724563e+02
1716.lowfreq: -8.2686 -0.0009 -0.0008 -0.0005 2.3507 3.4113 14.4615 21.2910 24.5988
frequency: 14.1014 21.2336 24.5782 25.9654 35.1257 44.2820 48.8761 49.8269 52.8928 61.5686 70.1145 75.7014 90.0553 103.2234 134.2500 141.8488 158.2352 183.2904 197.6860 210.4900 223.2539 226.0274 237.0277 249.9288 253.0724 258.5416 280.0035 294.1121 307.9646 317.6516 346.1939 361.1286 381.1020 393.8551 404.4112 412.5563 419.2637 444.0880 476.2394 500.9469 515.2025 537.1757 546.4810 566.4920 588.4334 617.3691 644.4678 659.4068 661.8698 692.0378 703.9218 722.5425 729.6058 739.9214 758.8382 775.7964 811.5436 817.0307 840.0315 842.8407 857.3372 860.8464 888.0340 913.4773 918.5619 926.7551 933.0259 943.3824 948.6135 959.5532 961.2057 964.0484 981.6498 984.8147 989.2748 991.5044 999.0386 1025.9194 1029.2110 1061.4609 1090.3603 1107.6106 1113.3149 1126.9929 1138.3718 1155.6530 1161.9843 1173.8141 1176.6983 1179.1237 1187.1027 1198.0609 1213.7066 1225.0977 1234.9762 1238.2581 1248.7493 1255.8293 1271.3311 1286.7467 1304.9510 1308.2714 1319.3364 1329.1793 1335.1827 1335.3865 1347.5756 1351.1496 1352.6662 1360.6426 1377.9992 1379.8411 1386.2053 1397.3393 1398.0793 1442.4022 1452.8127 1455.9801 1467.3937 1468.6681 1470.8869 1471.0820 1475.9773 1477.9013 1482.3561 1483.3406 1484.8056 1491.6685 1494.9975 1510.0336 1595.3644 1608.2508 1614.7204 1632.3880 1662.0881 2962.8438 2968.0268 2969.0022 2971.9155 2972.0170 2973.0059 2983.3767 2990.7803 2997.1976 3012.7342 3033.3010 3052.0516 3055.9487 3060.9552 3061.5240 3064.8741 3068.8561 3069.5769 3072.1874 3073.2835 3074.1476 3104.8947 3121.1225 3125.2526 3137.2801 3147.4821 3163.9291 3414.5918 3517.8843 3560.8030
redmass: 4.2584 4.3389 3.0664 3.7153 4.8173 5.0246 5.0629 3.8607 4.8805 4.2914 5.0644 6.2256 5.3659 3.8649 5.0608 4.1496 4.7651 3.2922 2.6143 1.2872 1.7892 1.4946 2.2882 1.9611 3.1858 1.2008 4.3390 5.1459 2.9571 3.8855 3.0453 2.2891 2.2900 2.3945 2.8082 2.0823 1.9235 3.8217 3.8075 2.9081 3.6274 3.1574 1.4473 3.0299 4.2891 6.2785 1.4674 5.1576 5.0635 6.1136 1.7912 4.1372 1.4094 3.3596 2.1529 3.4254 2.7936 3.5054 2.2966 1.8706 1.5355 2.7857 2.4052 1.1924 1.2577 2.3805 1.5201 2.1385 2.0508 1.5792 1.8497 2.0236 1.4109 1.9196 2.8913 3.7424 1.3225 2.2639 2.3184 1.9378 1.5166 3.2797 2.9882 2.2505 2.2716 2.4761 2.3163 1.0572 1.7887 1.8404 1.1309 1.7271 1.9975 2.7525 1.2562 1.1757 1.3428 1.7278 1.3392 1.5248 1.3980 1.3134 1.7700 1.2580 1.3517 1.3347 1.4566 1.3673 1.5093 1.4422 1.2125 1.2141 7.9215 1.2117 1.2140 2.1604 1.1927 1.0808 1.1456 1.0747 1.0635 1.0780 1.0623 1.5075 1.0752 1.0849 2.0807 1.0537 1.0681 1.8112 6.1135 7.3055 6.0977 6.8791 8.9861 1.0826 1.0368 1.0357 1.0478 1.0688 1.0356 1.0771 1.0632 1.0642 1.0825 1.0579 1.0997 1.1025 1.0993 1.0996 1.0991 1.0995 1.0989 1.0992 1.0991 1.0988 1.1080 1.0861 1.0873 1.0921 1.0964 1.1015 1.0814 1.0642 1.0774
irintensity: 0.1397 0.0138 0.1047 0.0214 0.1056 2.1267 0.1940 0.1766 3.8861 0.0475 1.2578 5.7291 6.2659 0.6122 1.2492 1.5877 4.5910 1.2394 1.7410 2.7707 1.9036 1.3928 4.9854 0.8410 11.5949 0.7531 6.0604 0.9875 3.0754 0.1091 3.5651 15.5351 1.7940 3.2087 0.0068 1.2739 0.9291 3.3326 9.4639 14.0588 25.2508 48.2131 102.4413 14.5380 24.7191 0.5834 119.7947 37.9554 16.8870 25.7518 59.9243 8.6774 151.6324 21.6550 60.9233 13.3587 1.5506 11.4366 15.7912 6.5151 5.9691 18.4563 4.3017 5.7694 8.2566 4.9556 19.2927 35.4635 44.1651 5.6381 17.6232 17.2577 2.8009 33.2387 22.8883 12.1708 0.2842 58.5504 56.9770 159.5328 6.7244 30.8995 9.3596 0.9989 16.8051 9.4983 17.9274 0.2426 12.9978 6.0658 4.4882 121.5988 93.4420 20.0231 5.0394 11.9080 5.4753 63.5967 7.0374 22.1439 6.1998 7.8209 7.0809 1.0907 17.0127 8.7789 15.7043 0.5765 9.7592 2.8578 19.8138 19.9633 0.8307 19.2355 15.7587 9.5869 99.3613 7.8954 22.2373 18.8715 4.8084 38.7395 7.4037 195.8169 3.6302 11.6127 34.5586 22.2055 38.1998 343.8247 2.7357 64.7042 0.4530 292.5495 212.3479 22.7443 30.2026 39.9793 32.6059 9.4683 25.4807 14.1274 11.5426 29.2304 6.5665 35.0442 9.0603 2.8341 9.4981 16.3574 54.7365 35.5960 66.6941 64.4543 58.5616 76.1068 6.0970 5.8667 0.1081 11.0831 41.1154 19.3895 138.3215 30.2993 36.4142
temp: 298.150 k
press: 1.00000 atm
elementType: 8 8 8 8 8 7 7 6 6 6 6 6 6 6 6 6 6 6 6 6 6 6 6 6 6 6 6 1 1 1 1 1 1 1 1 1 1 1 1 1 1 1 1 1 1 1 1 1 1 1 1 1 1 1 1 1 1
symmnumber: 1
zpe: 1247292.3 jmol-1
zpe.correction: 0.475069 hartree
zpe.thermalcorrener: 0.504850 hartree
zpe.thermalcorrenthalpy: 0.505794 hartree
zpe.thermalcorrgfe: 0.409958 hartree
zpe.sumelectzpe: -1263.719332 hartree
zpe.sumelectthermal: -1263.689551 hartree
zpe.sumelectthermalent: -1263.688607 hartree
zpe.sumelectthermalfe: -1263.784443 hartree
dipole: 1.3881 -3.8796 -1.2881
dipole: 4.3171
quadrupole: -151.7492 -165.7921 -163.1442
quadrupole: 3.4179 7.9635 -7.9294
quadrupole: 8.4793 -5.5636 -2.9157 3.4179 7.9635 -7.9294
hfenergy: -1264.1944009 hartree
pointgroup: C01 [X(C20H30N2O5)]
dipole: -1.5151053 -0.3815012 0.6661 debye
polarizability: 258.5863524|-6.7907096|274.9956968|5.1344085|1.1093019|195.6901497 unknown
InChI: InChI=1S/C20H30N2O5/c1-13(2)10-16(18(23)21-17(19(24)25)11-14(3)4)22-20(26)27-12-15-8-6-5-7-9-15/h5-9,13-14,16-17,21-22,24H,10-12H2,1-4H3
charge 0 multiplicity 1
57 atoms
O  2.717094 -1.293737 -1.7585
O  3.544048 1.109798 2.22541
O  -2.060581 -1.15061 0.919106
O  4.698694 2.616811 0.889946
O  0.004328 -0.646532 1.96152
N  2.342243 -0.123691 0.21948
N  -0.133056 -1.955681 0.024661
C  1.480293 -3.657749 -0.784141
C  1.294411 -2.342718 -0.003163
C  0.729091 -4.883295 -0.200298
C  2.471702 2.039654 -1.108263
C  3.193619 0.997705 -0.191416
C  1.133766 2.618955 -0.583621
C  2.176612 -1.21017 -0.610835
C  0.906951 -6.09623 -1.144671
C  1.202354 -5.232263 1.231464
C  1.296993 3.461414 0.705058
C  0.474328 3.462253 -1.701977
C  3.890904 1.668931 0.986611
C  -0.665083 -1.201521 1.03793
C  -2.788295 -0.328263 1.947629
C  -3.228192 0.999668 1.374454
C  -2.360669 2.121385 1.41467
C  -4.513637 1.141436 0.793587
C  -2.772857 3.36176 0.879719
C  -4.927597 2.38135 0.258067
C  -4.057032 3.49506 0.30119
H  2.564512 -3.875736 -0.819062
H  1.181386 -3.489371 -1.837616
H  1.608659 -2.471886 1.049863
H  -0.355265 -4.647038 -0.150281
H  3.187596 2.861188 -1.306359
H  2.285675 1.523083 -2.068614
H  4.002242 0.567917 -0.818659
H  0.456577 1.76853 -0.358822
H  1.850327 -0.102125 1.124644
H  0.544917 -5.870286 -2.165239
H  0.35092 -6.976245 -0.772258
H  1.974518 -6.378824 -1.221769
H  0.995003 -4.418562 1.950398
H  0.689802 -6.138887 1.602422
H  2.291614 -5.430896 1.244352
H  -0.759718 -2.297459 -0.705716
H  1.609655 2.848219 1.56973
H  0.338293 3.942635 0.975213
H  2.048033 4.261356 0.562383
H  1.100926 4.338894 -1.957458
H  0.332424 2.867211 -2.623335
H  -0.517157 3.832999 -1.382701
H  4.035414 1.585697 2.948556
H  -3.648202 -0.961773 2.218109
H  -2.113536 -0.203248 2.811821
H  -1.36628 2.015185 1.864913
H  -5.189957 0.278354 0.760261
H  -2.10021 4.225936 0.921372
H  -5.924057 2.480981 -0.186399
H  -4.377443 4.459129 -0.109465
