program: Gaussian 09
title: 000100127
version: EM64L-G09RevD.01
frameworkgroup: C1[X(C20H34O4)]
method: RPBEPBE
basis: SDD
operation: Freq
keyword: #pfreq=noraman
keyword: PBEPBE/SDD
title: #p freq=noraman PBEPBE/SDD
converged: YES YES NO NO
title: Mulliken charges:
elementType: O O O O C C C C C C C C C C C C C C C C C C C C H H H H H H H H H H H H H H H H H H H H H H H H H H H H H H H H H H
charge: -0.260243 -0.459684 -0.196738 -0.197146 -0.071292 -0.066015 -0.232688 -0.590672 0.160555 -0.251770 -0.114740 -0.730339 -0.020008 0.468606 -0.724021 -0.265905 0.188477 -0.328613 -0.361607 -0.737717 -0.764784 -0.860192 -0.720401 -0.725994 0.279499 0.233667 0.250360 0.204062 0.217528 0.243208 0.258273 0.220420 0.228832 0.215394 0.193483 0.231562 0.223425 0.248661 0.214167 0.254273 0.225444 0.214644 0.224204 0.238734 0.211742 0.218879 0.225554 0.218033 0.268490 0.215383 0.228634 0.228754 0.212480 0.247123 0.330359 0.201846 0.208441 0.227374
chargesum: 0.00000
title: Mulliken charges with hydrogens summed into heavy atoms:
elementType: O O O O C C C C C C C C C C C C C C C C C C C C
charge: -0.260243 -0.129325 -0.196738 -0.197146 0.208207 0.167652 0.017672 -0.169082 0.160555 -0.008562 0.143533 -0.065693 0.173475 0.468606 -0.020374 -0.051738 0.188477 -0.074340 0.078481 -0.063038 -0.102318 -0.147685 -0.032045 -0.088333
polarizability: 2.43280869e+02 -1.40541645e+00 2.41769778e+02 1.29313872e+00 4.61734886e+00 1.96002491e+02
1716.lowfreq: -8.0738 -0.0005 -0.0003 0.0004 4.3380 5.3810 19.2772 25.8646 38.0905
frequency: 18.4724 25.5860 37.8733 44.2343 59.4540 60.8166 66.4091 74.6485 84.7457 92.4853 98.8768 114.6881 119.4922 133.8661 147.5875 160.4837 172.7729 187.9646 196.0603 200.4381 204.1567 210.9046 218.8064 223.5420 227.4368 245.9102 248.0870 271.0146 277.9881 278.3747 286.9242 310.0341 321.3571 332.9658 359.4067 385.5771 395.5531 404.0816 416.4201 444.8605 476.3195 490.0912 510.0248 525.9359 572.4411 580.8264 649.6333 657.5261 691.6632 737.3791 770.6032 773.1125 790.5047 802.4165 817.9488 823.3765 834.9050 845.6076 868.7373 875.0356 912.4352 924.8624 927.5334 935.7936 970.6873 972.5628 985.4483 997.2857 1003.2858 1007.8610 1035.9679 1040.8000 1043.4808 1048.2186 1053.1682 1058.2488 1075.8500 1078.3951 1086.2415 1097.8644 1108.0740 1112.2185 1121.0631 1138.8760 1146.4476 1148.1538 1165.0500 1192.3442 1202.7466 1215.5249 1223.0909 1228.0962 1241.6752 1253.9643 1269.4341 1274.9522 1277.8810 1283.8038 1303.2371 1311.9535 1314.2403 1316.0615 1323.0595 1341.1511 1349.6268 1366.7848 1368.4209 1371.9073 1377.3010 1385.0853 1392.2943 1393.1921 1393.7505 1395.4635 1398.2700 1457.9499 1463.7771 1466.1467 1469.5698 1470.4822 1472.0056 1473.1694 1473.8741 1477.2918 1479.0240 1480.0905 1480.9452 1483.4439 1484.7859 1486.4685 1492.9305 1620.2668 1682.5418 1757.6022 2953.0605 2959.9714 2969.8437 2970.6576 2976.3681 2977.0516 2978.9928 2979.3010 2981.1817 2986.6608 2990.6459 2991.3943 3010.6000 3025.3242 3027.3505 3036.4842 3041.4285 3047.1481 3066.1469 3067.0107 3070.0767 3072.4319 3073.0936 3076.2814 3078.7461 3079.0123 3080.1394 3085.5326 3085.9178 3092.3938 3094.0231 3098.3465 3100.2619 3548.7180
redmass: 4.5205 4.9668 3.3581 3.7874 3.3522 4.2970 4.4672 2.9737 2.3904 3.7770 3.4082 2.3184 1.7370 2.2091 3.0289 2.9606 2.5288 1.1460 1.1898 2.5679 1.5705 1.3437 2.0036 1.0769 1.1899 2.7235 3.2690 2.5442 2.1413 1.7478 2.2263 2.3921 4.4427 3.7055 3.1744 3.2252 2.7382 2.3292 3.7470 3.0412 2.8502 2.9474 3.5723 3.2835 3.2902 2.9865 5.2463 3.3949 6.5270 3.1982 3.1184 1.2994 4.1670 3.9448 2.4658 2.2072 2.2183 1.9808 1.5252 1.7580 2.0906 2.1715 1.6887 1.9684 1.5610 1.3253 1.8118 2.1242 1.7883 2.9391 1.8409 1.5594 2.0667 2.0340 2.1784 2.1834 1.7962 1.8585 1.9567 1.7449 1.7257 2.1560 2.4159 2.3674 2.2076 1.9480 1.9439 1.5500 1.6199 1.9312 1.4946 1.4049 1.4080 1.2345 1.2722 1.2907 1.3824 1.3400 1.4750 1.4461 1.3363 1.5367 1.5967 1.4756 1.3904 1.4123 1.4229 1.1809 1.2132 1.2185 1.2284 1.2007 1.2339 1.2247 1.2019 1.0860 1.0480 1.0469 1.0590 1.0694 1.0454 1.0477 1.0512 1.0629 1.0533 1.0505 1.0569 1.0523 1.0517 1.0631 1.0463 8.3839 6.9443 12.4180 1.0815 1.0594 1.0389 1.0365 1.0396 1.0366 1.0402 1.0781 1.0795 1.0351 1.0569 1.0411 1.0838 1.1004 1.0848 1.0875 1.0985 1.0960 1.0994 1.0910 1.0995 1.0969 1.0990 1.0990 1.0968 1.0992 1.0973 1.1001 1.0966 1.1006 1.0912 1.1003 1.1000 1.0653
irintensity: 2.7488 0.0092 2.5300 3.0767 0.0118 3.3129 1.9104 0.5361 0.3349 1.6792 2.8109 1.1494 1.5289 0.7822 0.5365 0.3291 1.3633 0.0826 1.0238 1.8136 1.5412 1.0324 1.3616 0.4341 0.2830 2.6168 7.9248 9.2297 31.1157 24.8278 19.9849 19.7261 11.6995 6.3411 1.1549 0.0313 9.3440 0.9095 0.0756 2.4725 0.9677 3.1567 19.0244 1.7861 3.8416 1.5464 4.8474 5.7453 8.1055 2.4592 0.9290 11.2688 59.8876 2.6148 10.8997 2.8004 7.5315 2.0114 17.7779 2.8987 22.6652 20.2324 4.0226 34.5364 16.8473 33.2109 19.8821 59.5767 55.1917 95.1551 3.8544 3.5353 14.2663 4.7937 4.7699 3.4854 21.9904 31.7545 9.2460 12.1028 6.3487 6.9164 18.5770 4.7810 9.2930 4.0617 1.7026 2.1582 28.8368 9.2412 2.4281 5.2055 13.7874 10.2187 0.6351 16.9325 1.5340 3.0855 17.1907 4.9172 3.1288 0.5863 19.5924 2.3789 3.6271 5.2230 3.7587 12.5537 16.3091 19.4344 4.2809 14.4913 54.1482 8.2760 24.8094 6.4285 11.4930 12.1318 1.4470 1.4890 9.6428 14.5342 8.9061 19.9956 5.6233 14.0090 26.7675 1.3551 6.2780 18.4756 15.6007 90.5469 6.2483 372.0230 18.9339 40.4819 37.2597 39.9651 23.1975 34.0431 39.4830 13.0192 12.8704 22.2986 8.0518 36.0153 16.1812 28.7858 7.1425 13.1540 2.5848 13.6616 16.7471 4.9721 69.4505 40.8259 44.9083 34.0032 46.2529 38.6858 34.4146 16.9995 21.1428 22.5452 14.4219 21.5318 22.6296 3.9917
temp: 298.150 k
press: 1.00000 atm
elementType: 8 8 8 8 6 6 6 6 6 6 6 6 6 6 6 6 6 6 6 6 6 6 6 6 1 1 1 1 1 1 1 1 1 1 1 1 1 1 1 1 1 1 1 1 1 1 1 1 1 1 1 1 1 1 1 1 1 1
symmnumber: 1
zpe: 1313258.0 jmol-1
zpe.correction: 0.500194 hartree
zpe.thermalcorrener: 0.529860 hartree
zpe.thermalcorrenthalpy: 0.530804 hartree
zpe.thermalcorrgfe: 0.439296 hartree
zpe.sumelectzpe: -1081.471042 hartree
zpe.sumelectthermal: -1081.441376 hartree
zpe.sumelectthermalent: -1081.440432 hartree
zpe.sumelectthermalfe: -1081.531939 hartree
dipole: -1.0376 -0.3993 -0.8227
dipole: 1.3830
quadrupole: -128.9689 -162.3426 -151.8110
quadrupole: 3.6500 7.3201 -16.8468
quadrupole: 18.7386 -14.6351 -4.1035 3.6500 7.3201 -16.8468
hfenergy: -1081.9712359 hartree
pointgroup: C01 [X(C20H34O4)]
dipole: 0.4306849 -0.1921837 0.2713809 debye
polarizability: 242.7594118|0.2009015|240.9529221|-6.280648|-6.7936925|197.3408046 unknown
InChI: InChI=1S/C20H34O4/c1-8-12(3)17(21)15(6)18(22)13(4)9-11(2)10-14(5)19-16(7)20(23)24-19/h9,12-17,19,21H,8,10H2,1-7H3
charge 0 multiplicity 1
58 atoms
O  1.423961 0.646236 -1.41969
O  -0.884369 0.634591 1.336272
O  1.505372 2.942783 -2.065658
O  -1.928059 -2.467655 1.911668
C  2.352749 0.280451 -0.218799
C  3.342977 -0.828579 -0.597021
C  2.835074 1.764957 -0.178544
C  2.717484 -2.259666 -0.457144
C  1.871371 2.001862 -1.356478
C  -2.807264 -0.711284 0.461974
C  -1.830286 0.492473 0.200661
C  4.615101 -0.75424 0.287845
C  -2.559952 1.835968 -0.096402
C  1.297914 -2.406958 -0.991995
C  2.542335 2.57354 1.096481
C  -1.212809 -2.634912 -0.41028
C  -1.982921 -1.973715 0.753336
C  0.27658 -2.557422 -0.101872
C  -1.524383 2.96163 -0.369602
C  -3.833312 -0.442859 1.584182
C  -3.545508 1.686939 -1.281915
C  1.129325 -2.339589 -2.497542
C  -1.691825 -4.111811 -0.552545
C  -2.121152 4.384332 -0.31995
H  1.690589 0.011365 0.621454
H  3.636618 -0.658105 -1.653258
H  3.885158 1.89727 -0.496247
H  3.400899 -2.969989 -0.967005
H  2.725731 -2.522185 0.619323
H  -3.342166 -0.886802 -0.493607
H  -1.161109 0.253428 -0.646294
H  4.354793 -0.814696 1.361749
H  5.285547 -1.602712 0.059819
H  5.187262 0.176425 0.124935
H  -3.13577 2.122009 0.810977
H  2.667161 3.65449 0.907522
H  3.233776 2.283537 1.907868
H  1.508268 2.394116 1.440271
H  -1.437576 -2.093598 -1.348306
H  0.513928 -2.630945 0.969452
H  -1.049134 2.791616 -1.355392
H  -0.718619 2.881104 0.383858
H  -4.498631 0.399246 1.328612
H  -4.454055 -1.338959 1.754899
H  -3.340362 -0.227384 2.550248
H  -4.386694 1.007205 -1.054258
H  -3.981323 2.6651 -1.550291
H  -3.02115 1.300186 -2.177207
H  1.386861 -1.331297 -2.871891
H  1.804936 -3.062874 -2.995255
H  0.099387 -2.565303 -2.820555
H  -1.126948 -4.612901 -1.35796
H  -2.770857 -4.167989 -0.791704
H  -1.516781 -4.65449 0.392096
H  -1.40749 0.683356 2.17717
H  -2.578885 4.592282 0.666766
H  -2.899008 4.538403 -1.090633
H  -1.333962 5.140318 -0.49394
