program: Gaussian 09
title: 000100126
version: EM64L-G09RevD.01
frameworkgroup: C1[X(C12H18N2O6)]
method: RPBEPBE
basis: SDD
operation: Freq
keyword: #p
keyword: freq=noraman
keyword: PBEPBE/SDD
title: #p freq=noraman PBEPBE/SDD
converged: YES YES NO NO
title: Mulliken charges:
elementType: O O O O O O N N C C C C C C C C C C C C H H H H H H H H H H H H H H H H H H
charge: -0.327571 -0.218528 -0.186555 -0.174452 -0.173121 -0.309012 -0.119423 -0.394885 0.337821 -0.501359 -0.500179 -0.206440 -0.702773 -0.710182 -0.710548 0.218833 0.212600 0.288331 0.329670 -0.659560 0.270484 0.272551 0.272507 0.270388 0.296372 0.226702 0.229964 0.204515 0.224186 0.209152 0.268737 0.269897 0.209583 0.218508 0.345426 0.233649 0.239881 0.244831
chargesum: 0.00000
title: Mulliken charges with hydrogens summed into heavy atoms:
elementType: O O O O O O N N C C C C C C C C C C C C
charge: -0.327571 -0.218528 -0.186555 -0.174452 -0.173121 -0.309012 -0.119423 -0.049458 0.337821 0.041675 0.042716 0.089932 -0.041592 -0.008107 -0.012560 0.218833 0.212600 0.288331 0.329670 0.058801
polarizability: 2.04356714e+02 3.71012895e+00 1.61232231e+02 6.21642922e+00 6.14830331e+00 1.32712208e+02
1716.lowfreq: -7.7689 -4.9509 0.0006 0.0010 0.0011 2.0191 8.2227 17.6335 31.3305
frequency: 5.2312 17.1440 31.2726 38.2107 49.7878 63.3429 71.6685 78.5629 99.4132 110.4090 117.0273 151.6354 181.9602 187.4876 217.1389 236.3283 246.2081 251.5245 276.3799 304.3587 312.6587 321.6689 330.2048 364.3643 386.3276 402.5804 433.3879 444.3770 502.3441 534.1535 543.6445 550.0562 555.7919 573.9213 614.9221 632.7827 678.7310 696.1855 704.1380 718.3707 752.3218 755.4576 817.9209 820.8106 898.9156 914.8755 920.5389 955.2367 964.2455 990.1183 1001.4414 1005.9480 1017.6165 1031.2828 1032.7630 1034.3331 1081.4962 1124.2947 1147.8495 1160.7869 1166.1078 1190.3930 1209.7133 1219.1901 1231.5903 1258.7964 1271.5218 1290.1777 1294.4208 1295.1853 1318.5821 1374.3659 1377.2435 1383.1465 1399.5616 1436.6694 1445.1392 1452.8667 1464.9630 1467.3752 1467.4519 1469.2809 1470.9032 1480.4798 1484.6065 1502.8449 1637.1388 1663.7115 1702.8160 1732.2459 2988.8100 2990.7812 2995.7057 2998.6078 3030.0651 3038.9114 3044.3008 3080.8520 3084.8624 3084.9280 3097.4065 3099.1164 3101.8236 3105.2524 3112.7708 3112.8155 3116.6331 3577.7992
redmass: 6.1772 4.4217 3.9203 7.0790 5.2713 4.2971 4.4896 2.1177 4.2428 9.2673 4.2111 4.6713 1.0922 3.1955 1.2238 1.3199 1.9094 1.0761 4.9225 3.6150 8.1696 6.3722 2.5915 8.9989 3.8884 2.7826 2.8411 2.7607 4.5243 3.5631 3.3021 4.3304 3.2737 1.3588 5.5194 6.2607 6.4650 7.4455 11.5145 6.3304 4.9684 8.3873 1.5159 3.1947 2.0613 1.5965 1.6310 1.2025 3.1739 3.7391 2.8511 2.2052 5.4914 1.4176 1.4357 4.4593 2.5852 3.6836 1.1938 2.2817 11.4307 3.1087 1.1100 2.0821 2.9519 3.0193 2.9462 1.4709 1.7525 1.5917 1.3540 1.2293 1.2322 1.1886 1.2169 1.0737 1.0465 1.0896 1.1255 1.0571 1.0965 1.0803 1.0656 1.0526 1.5156 1.0627 8.4941 12.6054 12.6315 12.3272 1.0361 1.0356 1.0363 1.0342 1.0594 1.0630 1.0842 1.0994 1.1037 1.0991 1.0993 1.1004 1.1019 1.1010 1.1005 1.1017 1.0995 1.0776
irintensity: 0.1331 0.1074 2.2137 0.9676 1.0490 6.6352 5.0242 0.3761 2.4313 6.9457 1.8927 2.0194 0.0687 1.8343 2.5576 1.8520 5.8856 0.1908 0.9410 9.1557 3.6023 4.5488 2.8015 25.2444 7.6474 0.7721 3.8783 2.9317 10.0846 0.1055 4.7688 2.2489 5.3046 132.1501 3.2615 53.7292 16.8496 6.9486 16.2731 23.0019 84.2652 12.3919 16.0746 33.1825 8.3431 0.7428 1.1236 0.1724 115.4835 247.5372 133.6356 12.4979 12.8335 0.0274 6.9136 21.6693 30.0716 56.5068 0.5802 424.5467 247.0515 19.9514 0.0443 79.7743 67.6663 26.6502 19.0929 17.8164 28.9141 11.2333 70.9481 42.5635 40.9817 23.6879 36.6022 1.1171 0.9733 26.7649 98.3264 2.6512 76.9285 43.5609 11.9162 3.7346 207.5351 54.4964 234.7719 558.5966 88.8693 63.7309 23.6475 11.3273 30.2386 10.5143 10.5528 1.4888 17.9083 10.6890 0.0213 19.0685 55.6323 31.6877 4.6869 16.7104 3.0249 15.0462 16.4840 44.8488
temp: 298.150 k
press: 1.00000 atm
elementType: 8 8 8 8 8 8 7 7 6 6 6 6 6 6 6 6 6 6 6 6 1 1 1 1 1 1 1 1 1 1 1 1 1 1 1 1 1 1
symmnumber: 1
zpe: 779270.7 jmol-1
zpe.correction: 0.296809 hartree
zpe.thermalcorrener: 0.319049 hartree
zpe.thermalcorrenthalpy: 0.319993 hartree
zpe.thermalcorrgfe: 0.241010 hartree
zpe.sumelectzpe: -1027.379318 hartree
zpe.sumelectthermal: -1027.357078 hartree
zpe.sumelectthermalent: -1027.356134 hartree
zpe.sumelectthermalfe: -1027.435117 hartree
dipole: 1.7518 -1.5771 2.5814
dipole: 3.4957
quadrupole: -87.0967 -119.8234 -125.6192
quadrupole: -7.8138 -3.9175 -3.2291
quadrupole: 23.7497 -8.9770 -14.7728 -7.8138 -3.9175 -3.2291
hfenergy: -1027.6761263 hartree
pointgroup: C01 [X(C12H18N2O6)]
dipole: -0.7087618 -0.6951203 -0.9518115 debye
polarizability: 204.1220979|-4.3821507|160.0040934|6.3694752|-8.9677858|134.1749618 unknown
InChI: InChI=1S/C12H18N2O6/c1-7(13-11(18)19-12(2,3)4)10(17)20-14-8(15)5-6-9(14)16/h7,13H,5-6H2,1-4H3
charge 0 multiplicity 1
38 atoms
O  3.116745 -0.4343 -0.586925
O  -1.346328 0.083119 -0.325355
O  -3.635555 1.320966 -1.558871
O  -2.24256 -2.195642 1.255114
O  -1.862214 1.541279 1.4668
O  2.960549 1.115791 1.209693
N  -2.684693 -0.382116 -0.213649
N  1.22336 0.768243 -0.324419
C  4.514408 -0.92601 -0.222588
C  -5.013506 -0.501406 -0.507118
C  -4.549994 -1.664779 0.412969
C  0.326457 1.738407 0.297696
C  4.778311 -1.964991 -1.325729
C  4.47571 -1.578554 1.173553
C  5.507263 0.250845 -0.301949
C  -3.754802 0.295366 -0.860017
C  -3.034179 -1.509089 0.583663
C  -1.047715 1.158538 0.625176
C  2.485585 0.531983 0.197387
C  0.109832 3.011916 -0.572125
H  -5.487484 -0.851566 -1.439761
H  -5.728605 0.176808 -0.011672
H  -5.01774 -1.633847 1.411281
H  -4.757729 -2.660353 -0.014749
H  0.793615 2.031226 1.255256
H  4.740064 -1.492039 -2.322152
H  4.022753 -2.768429 -1.290294
H  5.777859 -2.414074 -1.186636
H  3.708883 -2.372691 1.206532
H  5.457469 -2.037537 1.391291
H  4.253621 -0.832564 1.952763
H  5.285879 1.006477 0.467972
H  6.534975 -0.125218 -0.145641
H  5.4629 0.72673 -1.297836
H  0.916557 0.223243 -1.130724
H  -0.361308 2.755316 -1.53679
H  -0.536312 3.736594 -0.047566
H  1.090631 3.47826 -0.761781
