program: Gaussian 09
title: 000102157
version: EM64L-G09RevD.01
frameworkgroup: C1[X(C8F18)]
method: RPBEPBE
basis: SDD
operation: Freq
keyword: #p
keyword: freq=noraman
keyword: PBEPBE/SDD
title: #p freq=noraman PBEPBE/SDD
converged: YES YES NO NO
title: Mulliken charges:
elementType: F F F F F F F F F F F F F F F F F F C C C C C C C C
charge: -0.126726 -0.125804 -0.117762 -0.114285 -0.119824 -0.113707 -0.109599 -0.125706 -0.102541 -0.128561 -0.103337 -0.109809 -0.127490 -0.117731 -0.115793 -0.120211 -0.120801 -0.116342 0.063201 0.057567 0.233084 0.229314 0.391648 0.392364 0.370185 0.378665
chargesum: 0.00000
title: Mulliken charges with hydrogens summed into heavy atoms:
polarizability: 1.04608292e+02 -2.15166944e+00 9.42212809e+01 8.76057374e-01 -1.02013073e+00 9.14207083e+01
1716.lowfreq: -7.7391 -4.8625 -0.0010 -0.0010 -0.0007 6.3398 41.0030 46.8797 60.9396
frequency: 40.8350 46.8598 60.9211 73.0942 74.9156 92.9094 104.7477 112.6207 119.0006 145.2587 158.5090 169.1469 178.8110 181.2832 200.7493 211.8762 224.0209 236.7565 250.0627 265.2921 271.5721 272.8949 279.1186 294.3000 304.2411 307.3443 313.3744 323.4657 335.3789 337.2977 375.0984 379.2836 437.4593 445.4290 460.1498 466.4388 472.2383 479.2743 502.8122 520.0183 527.8171 540.0320 567.1695 579.5830 629.5342 640.2112 649.6376 662.2241 768.1461 819.7393 839.6034 957.6082 967.6836 999.0368 1005.5042 1013.0524 1019.5913 1029.7242 1038.5686 1044.6007 1055.9156 1062.2039 1069.7830 1073.0895 1083.2601 1096.8561 1101.5415 1106.9669 1118.5060 1134.7982 1183.3697 1200.9123
redmass: 18.2157 18.7932 18.8508 18.2345 18.7237 18.6074 18.5614 18.0771 18.1768 18.1242 17.9327 17.8004 17.9438 17.7018 17.8842 18.4206 18.4540 18.0975 18.3713 18.3162 18.3455 18.3419 18.5019 18.6199 18.6580 18.6698 18.7388 18.8070 18.7058 18.7227 18.0521 18.0429 17.6265 17.7597 17.8271 17.8851 17.8472 17.8304 17.6116 17.8772 17.6641 17.3714 17.3864 17.4375 16.4930 16.7946 17.0067 17.5498 14.1963 14.0855 13.9230 13.4473 13.5261 13.2510 13.2939 13.2672 13.1485 13.0823 12.9534 13.0319 12.9536 12.7763 13.1120 13.0784 13.1339 12.8362 12.7524 12.6714 12.4877 12.2880 12.3490 12.3163
irintensity: 0.0124 0.0356 0.0272 0.0094 0.1239 0.1989 0.0713 0.2031 0.2161 0.2445 4.4899 1.3200 1.2403 1.3592 4.1281 1.3070 0.5638 2.5733 2.9513 0.1635 1.1303 1.8536 0.7431 0.9610 0.2847 1.1595 0.3098 0.4555 0.0339 1.0774 3.9237 4.1021 12.1230 2.1167 16.5448 0.8205 0.2471 2.0104 0.6416 1.1203 5.4156 7.2063 13.0151 8.1609 66.3799 39.0890 29.9056 0.3203 105.5358 38.8608 63.5251 70.6854 1.9560 30.5384 37.9348 33.3872 4.7422 4.1076 16.9520 21.5852 298.1728 179.4342 154.1252 305.6980 317.0320 294.3607 114.3582 313.5818 211.5710 17.8901 29.2688 23.3386
temp: 298.150 k
press: 1.00000 atm
elementType: 9 9 9 9 9 9 9 9 9 9 9 9 9 9 9 9 9 9 6 6 6 6 6 6 6 6
symmnumber: 1
zpe: 239917.8 jmol-1
zpe.correction: 0.091380 hartree
zpe.thermalcorrener: 0.116269 hartree
zpe.thermalcorrenthalpy: 0.117213 hartree
zpe.thermalcorrgfe: 0.038172 hartree
zpe.sumelectzpe: -2099.913255 hartree
zpe.sumelectthermal: -2099.888366 hartree
zpe.sumelectthermalent: -2099.887422 hartree
zpe.sumelectthermalfe: -2099.966463 hartree
dipole: -0.0847 0.0965 0.2613
dipole: 0.2911
quadrupole: -148.1336 -146.2194 -146.0025
quadrupole: 0.6460 -0.1871 0.3322
quadrupole: -1.3484 0.5658 0.7827 0.6460 -0.1871 0.3322
hfenergy: -2100.0046351 hartree
pointgroup: C01 [X(C8F18)]
dipole: -0.033615 -0.0119568 -0.1088484 debye
dipolederiv: -0.326178 0.0189073 -0.0761224 0.0194082 -0.3243059 0.126209 -0.078335 0.1272284 -0.3960284 -0.3179144 0.0096129 0.0648395 0.0050329 -0.2956856 -0.122102 0.0658902 -0.1132451 -0.4224493 -0.373349 -0.1344524 0.0888479 -0.0971816 -0.5494049 0.1433885 0.0978216 0.0960129 -0.3010662 -0.3962182 0.0661403 -0.1556155 0.0261813 -0.2529862 0.0018677 -0.1042021 0.091172 -0.5432308 -0.413532 -0.1758699 -0.0502199 -0.1317171 -0.5880858 -0.033771 -0.0332998 0.037 -0.2412387 -0.3522089 0.0786615 0.0971866 0.0431085 -0.3285988 -0.1180875 0.0525451 -0.196321 -0.5056861 -0.5959987 0.170912 -0.0728283 0.2595233 -0.4322739 -0.0232648 -0.0046674 -0.0616189 -0.298874 -0.2434821 -0.042767 0.0336471 -0.0368464 -0.4746098 0.1122132 0.0409314 0.1945475 -0.6067228 -0.5384209 -0.2171136 -0.0182235 -0.2777796 -0.5061044 -0.0866784 -0.0811063 -0.1380045 -0.2940548 -0.7194794 -0.0952782 -0.0981596 -0.0089484 -0.3361831 0.0631416 -0.2005921 0.0331651 -0.3481231 -0.2445031 -0.0058516 -0.0159317 -0.0517826 -0.7220975 -0.1235027 -0.0233945 -0.0697663 -0.3318041 -0.4500275 0.0427253 0.1864817 0.0083219 -0.2981426 0.0593041 0.2590272 0.0095677 -0.5610792 -0.344543 -0.0201963 0.0752613 -0.1017737 -0.6945488 0.1624742 0.1037875 0.0827507 -0.3340117 -0.3800835 0.0535446 -0.0894423 0.0416893 -0.2731767 0.0004091 -0.163628 0.0524658 -0.6612306 -0.8347891 -0.0657407 0.0708362 0.0013844 -0.287751 -0.0364835 0.1267814 -0.0270439 -0.2928008 -0.3166294 0.028834 -0.0509879 -0.0554121 -0.7205676 -0.0801532 -0.0687396 0.0039777 -0.2990598 -0.8284838 -0.1140871 -0.0457682 -0.0762798 -0.2918871 0.0271473 -0.1214782 0.0222851 -0.3040424 -0.3900013 0.0645019 0.0837198 0.0662492 -0.2770842 -0.0502644 0.1678416 -0.1046333 -0.645808 0.1922621 -0.0667818 -0.0059865 0.0983396 0.265105 -0.2219511 0.1941482 -0.1401817 0.2811174 0.2071079 -0.0334004 0.0298831 0.1593069 0.2403986 0.2057658 -0.1689864 0.1383473 0.3100639 0.9054298 0.0815498 -0.0046748 0.037961 0.7475743 -0.1882825 0.0631855 -0.213023 0.8369735 0.8517251 0.0931855 -0.0033722 0.046771 0.8715084 0.1773733 -0.1094497 0.2056691 0.7229997 1.3798652 0.0822463 0.0828778 0.0353879 1.4640666 0.0059226 -0.0102247 0.0765176 1.2930999 1.423217 0.0508929 -0.0939818 0.0033024 1.4384181 0.0027395 0.0005258 -0.0615712 1.3189064 1.5528963 0.0755452 -0.0127205 -0.0159887 1.3003759 -0.0862961 -0.1366792 -0.0925458 1.3220371 1.553339 0.0542794 -0.0195457 0.0017419 1.3260468 0.0828813 0.1322976 0.0472479 1.3021128 unknown
polarizability: 104.6115459|2.2879419|94.5311677|-0.3648073|-0.2494956|91.1075681 unknown
InChI: InChI=1S/C8F18/c9-1(5(15,16)17,3(11,12)7(21,22)23)2(10,6(18,19)20)4(13,14)8(24,25)26
charge 0 multiplicity 1
26 atoms
F  0.009422 -1.445774 1.048253
F  0.139859 1.243521 1.176005
F  -2.458792 -1.790888 0.68899
F  -2.715317 -0.331369 -1.041053
F  2.580217 1.676228 0.018605
F  2.482848 -0.267267 -1.179782
F  0.921808 -2.404186 -1.191711
F  -0.110292 -0.87682 -2.523871
F  -1.287195 -2.544063 -1.546119
F  -1.161871 1.585849 -1.690939
F  0.262064 2.988622 -0.654196
F  1.012892 1.624499 -2.290825
F  -2.394218 1.836535 0.780931
F  -2.038665 0.347408 2.474193
F  -3.978679 0.319394 1.311117
F  2.624743 -1.783287 1.04607
F  4.036568 -0.040495 1.264423
F  2.104013 -0.065095 2.440948
C  -0.458545 -0.700246 -0.092131
C  0.44802 0.608383 -0.077624
C  -2.035168 -0.538341 0.177967
C  2.024318 0.370294 -0.007855
C  -0.237835 -1.646358 -1.355397
C  0.14486 1.712709 -1.200938
C  -2.596935 0.520269 1.207375
C  2.681879 -0.399623 1.217463
