program: Gaussian 09
title: 000102124
version: EM64L-G09RevD.01
frameworkgroup: C1[X(C4H10ClO2P)]
method: RPBEPBE
basis: SDD
operation: Freq
keyword: #p
keyword: freq=noraman
keyword: PBEPBE/SDD
title: #p freq=noraman PBEPBE/SDD
converged: YES YES NO NO
title: Mulliken charges:
elementType: Cl P O O C C C C H H H H H H H H H H
charge: -0.233492 1.047935 -0.515243 -0.576614 0.026127 -0.662988 -0.665554 -0.876068 0.239609 0.213348 0.248372 0.231245 0.210171 0.233353 0.228398 0.287231 0.282988 0.281183
chargesum: 0.00000
title: Mulliken charges with hydrogens summed into heavy atoms:
elementType: Cl P O O C C C C
charge: -0.233492 1.047935 -0.515243 -0.576614 0.265736 0.029978 0.006367 -0.024667
polarizability: 9.67868387e+01 3.16293640e+00 8.79729514e+01 -3.56049874e+00 -3.17553393e+00 7.29764248e+01
1716.lowfreq: -0.0010 -0.0006 0.0006 6.4040 11.2378 16.2700 25.6995 71.3466 115.5710
frequency: 23.5819 71.3396 115.5689 161.2154 167.1129 181.8848 194.8118 222.3906 238.8593 257.6653 323.6407 334.8845 394.7559 445.2327 453.8880 638.6446 707.0288 836.6526 903.5986 929.0267 941.1779 945.4755 966.9612 1058.7187 1099.3112 1154.8916 1179.3002 1320.4047 1337.9413 1347.7212 1384.1278 1398.8690 1428.8287 1431.4684 1455.8567 1462.4427 1472.0113 1484.2802 2991.5286 2995.3311 3007.7849 3027.4953 3087.7295 3094.8344 3102.5015 3107.6457 3150.6745 3161.5602
redmass: 2.9600 5.3768 4.0477 1.6335 1.8670 3.7381 1.0454 2.9540 1.3137 5.4836 4.5817 2.9323 4.9239 3.4113 3.9205 4.5912 5.5516 5.0127 3.0444 1.2132 1.3818 1.5200 1.3287 5.1930 1.6934 2.0948 1.9341 1.1829 1.4835 1.1605 1.2575 1.2107 1.0444 1.0445 1.0496 1.0480 1.0504 1.0482 1.0358 1.0358 1.0868 1.0311 1.0989 1.0993 1.1010 1.1006 1.1026 1.1026
irintensity: 0.6123 1.9932 10.1304 0.7546 2.5446 3.7631 0.0374 6.2221 0.3010 3.1495 7.2289 10.8145 71.1573 19.0572 39.6928 28.9412 19.0103 183.3861 110.4672 3.0352 0.4331 9.2043 49.5231 106.5101 81.1195 13.1625 12.6021 20.5305 2.7330 16.2714 31.3346 23.5688 11.1056 10.8452 7.1977 2.7165 8.6533 18.0794 11.0128 17.0708 12.3958 0.2306 11.1556 32.7924 15.1793 35.3107 0.4579 0.1882
temp: 298.150 k
press: 1.00000 atm
elementType: 17 15 8 8 6 6 6 6 1 1 1 1 1 1 1 1 1 1
symmnumber: 1
zpe: 366049.3 jmol-1
zpe.correction: 0.139421 hartree
zpe.thermalcorrener: 0.150881 hartree
zpe.thermalcorrenthalpy: 0.151825 hartree
zpe.thermalcorrgfe: 0.101251 hartree
zpe.sumelectzpe: -1109.501868 hartree
zpe.sumelectthermal: -1109.490408 hartree
zpe.sumelectthermalent: -1109.489464 hartree
zpe.sumelectthermalfe: -1109.540038 hartree
dipole: -2.0507 -2.1591 -2.1305
dipole: 3.6615
quadrupole: -56.9099 -62.0777 -70.5253
quadrupole: -6.5189 -4.7287 3.4581
quadrupole: 6.2611 1.0933 -7.3543 -6.5189 -4.7287 3.4581
hfenergy: -1109.641289 hartree
pointgroup: C01 [X(C4H10Cl1O2P1)]
dipole: -0.7296639 1.1591147 -0.4462769 debye
dipolederiv: -0.5634204 0.0128329 -0.2392108 -0.0044178 -0.3132621 0.02238 -0.2985179 0.0621307 -0.7962981 2.0039251 -0.0064857 0.0703508 -0.2922826 1.1936882 0.0145599 0.0847267 -0.033059 1.7861211 -1.5936987 -0.0193355 0.2657445 0.0516168 -0.5530132 0.1018105 0.2903056 0.0442251 -0.6106548 -0.6782636 -0.0350594 0.0317723 0.0425509 -0.5958312 -0.0962801 0.0529131 -0.0472763 -0.6732396 1.0761458 -0.0175244 -0.1324758 0.4039499 0.2790208 -0.1379735 -0.2196383 -0.0639804 0.4256334 -0.0752535 0.0419276 -0.0123868 -0.0455685 -0.0153969 0.1090224 0.0301324 0.1123055 -0.1515989 -0.1699932 0.0899911 0.0150945 -0.0070765 -0.0127079 0.0557605 0.0143942 0.0446942 0.0316822 -0.2573633 0.0074357 -0.0258003 -0.0469725 -0.2440906 0.0274506 0.0278948 0.0185038 -0.2283825 -0.0222656 0.0233406 0.0272738 -0.0732635 -0.0357658 -0.0624881 -0.0095176 -0.075082 -0.0552298 -0.1183254 -0.0990869 0.0652559 -0.096482 0.0796715 0.0252445 0.0571952 0.0128157 0.0787469 0.0083158 0.1254417 -0.037192 0.1152311 0.0018161 0.0040443 -0.0038954 -0.0004697 0.0572821 0.1078922 -0.0261897 -0.0464692 -0.0177598 -0.0338754 -0.110779 -0.0265802 -0.0571256 -0.0029404 -0.1387628 -0.0577994 0.0360312 -0.0723541 0.0389311 0.0133098 0.0503425 0.0167291 0.1055191 0.1266238 0.0014038 0.0134503 0.0265344 0.0461464 0.0812587 -0.0156088 0.0969504 -0.1059761 0.1052666 -0.041229 -0.0499192 0.0146428 -0.0190359 -0.0873797 -0.0197048 -0.1260948 -0.010405 0.1220101 -0.0121394 0.0153005 -0.0061408 0.0033116 -0.0471844 0.0138133 -0.0443232 0.0559797 -0.0183763 0.0394406 0.0214684 0.0212648 0.0927356 0.0174976 0.0291131 0.0070234 0.1104669 0.0855436 -0.0269646 -0.0182881 -0.0134726 0.0876576 0.0697458 -0.0573679 0.0320331 -0.0167061 unknown
polarizability: 97.5437967|-0.474331|72.5334391|3.2067164|-2.9169203|87.6589791 unknown
InChI: InChI=1S/C4H10O2P.Cl/c1-4(2)6-7(3)5;/h4H,1-3H3;
charge 0 multiplicity 1
18 atoms
Cl 1.996539 -0.675308 1.160157
P  0.925638 -0.525066 -0.874445
O  -0.511631 0.35946 -0.538736
O  0.738622 -1.940991 -1.574029
C  -1.796754 -0.372936 -0.217678
C  -1.729054 -0.976058 1.191291
C  -2.877928 0.697098 -0.384158
C  1.949481 0.773931 -1.707446
H  -1.910948 -1.17269 -0.975613
H  -2.703547 -1.434755 1.440481
H  -0.955241 -1.759374 1.264833
H  -1.508071 -0.194135 1.937967
H  -3.874263 0.24884 -0.217723
H  -2.85172 1.127938 -1.399092
H  -2.731406 1.509802 0.348175
H  1.924725 1.685665 -1.093811
H  2.98223 0.405247 -1.793581
H  1.527429 0.971132 -2.705192
