program: Gaussian 09
title: 000100122
version: EM64L-G09RevD.01
frameworkgroup: C1[X(C10H11NO3)]
method: RPBEPBE
basis: SDD
operation: Freq
keyword: #p
keyword: freq=noraman
keyword: PBEPBE/SDD
title: #p freq=noraman PBEPBE/SDD
converged: YES YES NO NO
title: Mulliken charges:
elementType: O O O N C C C C C C C C C C H H H H H H H H H H H
charge: -0.429901 -0.212804 -0.277548 -0.318416 -0.556651 -0.160458 0.516594 -0.383356 -0.430290 0.161322 -0.249045 -0.225367 -0.244576 -0.028051 0.216336 0.258302 0.293613 0.320214 0.262011 0.227577 0.232566 0.226056 0.229595 0.181059 0.391219
chargesum: 0.00000
title: Mulliken charges with hydrogens summed into heavy atoms:
elementType: O O O N C C C C C C C C C C
charge: -0.038682 -0.212804 -0.277548 0.001797 -0.082013 0.133155 0.516594 -0.121345 -0.202713 0.161322 -0.016479 0.000688 -0.014981 0.153008
polarizability: 1.46750717e+02 -1.18934808e+01 1.13618527e+02 3.95867554e+00 1.43846164e+01 9.30996187e+01
1716.lowfreq: -10.1837 -4.4767 -0.0008 -0.0005 -0.0003 6.8662 22.8192 31.3578 49.7002
frequency: 22.7543 31.3509 49.6299 71.1504 92.1394 159.4761 179.3074 197.0324 241.1250 288.1832 341.6860 403.4882 437.6949 465.5108 485.6510 543.1675 576.0593 602.8456 614.7006 618.5128 695.2200 701.4906 723.1381 744.8331 804.0416 852.1451 860.9527 882.2860 921.6315 964.1161 975.4711 990.3790 996.4435 1017.4744 1031.6881 1066.9943 1078.5773 1093.6103 1172.4061 1175.9420 1196.8303 1210.9713 1225.6800 1266.6118 1300.3864 1310.7393 1315.7659 1350.5442 1362.3481 1382.7126 1439.1453 1460.4757 1479.7121 1488.7084 1593.3631 1615.0188 1631.1893 1669.1419 2957.8647 2976.9761 3028.0537 3051.6424 3112.4158 3127.0693 3137.2390 3148.1474 3164.3734 3522.7566 3552.3276
redmass: 5.1012 6.9077 4.4801 7.6368 5.0400 6.2306 4.3846 3.9432 3.9057 2.9655 3.6900 2.8013 4.1362 2.9924 4.9819 4.7299 1.4622 1.3873 3.3459 3.4073 4.1415 2.2872 2.7919 1.9084 4.8120 1.2612 1.8746 4.1631 1.5247 1.5894 1.4378 4.3073 1.4165 3.0139 2.2007 3.6880 2.1309 1.7215 1.1476 1.3261 1.1928 2.2176 1.6297 1.4658 1.5914 1.4243 1.5974 1.2872 1.2265 6.1775 1.9502 1.2190 1.6659 2.2081 5.8830 5.9201 5.7369 9.3036 1.0878 1.0592 1.0983 1.0865 1.0875 1.0862 1.0914 1.0960 1.1015 1.0642 1.0782
irintensity: 0.8879 1.6555 0.6632 12.7674 1.2856 4.1306 10.3388 17.0721 13.9394 4.7458 7.6926 0.4522 3.6211 11.4956 16.1578 19.5385 23.3655 239.5869 44.9798 32.4471 29.4801 30.3351 27.0988 40.4068 9.8471 1.4944 11.2392 58.7436 2.2371 3.2901 0.1142 0.2624 0.2140 1.6205 10.7324 9.1986 225.6810 17.4393 4.9235 12.6526 6.5514 4.0616 35.3702 15.6403 31.9067 0.7095 13.9515 1.8276 19.2767 0.5709 5.7038 57.8328 94.1238 21.8516 1.7598 8.0797 201.3850 246.2865 96.1567 17.5695 11.4998 6.8285 9.0081 0.3408 16.5545 28.6926 21.8410 35.9563 30.2921
temp: 298.150 k
press: 1.00000 atm
elementType: 8 8 8 7 6 6 6 6 6 6 6 6 6 6 1 1 1 1 1 1 1 1 1 1 1
symmnumber: 1
zpe: 509899.4 jmol-1
zpe.correction: 0.194210 hartree
zpe.thermalcorrener: 0.207408 hartree
zpe.thermalcorrenthalpy: 0.208352 hartree
zpe.thermalcorrgfe: 0.151985 hartree
zpe.sumelectzpe: -667.070971 hartree
zpe.sumelectthermal: -667.057773 hartree
zpe.sumelectthermalent: -667.056829 hartree
zpe.sumelectthermalfe: -667.113196 hartree
dipole: 0.4540 -2.4545 -3.9025
dipole: 4.6325
quadrupole: -71.6143 -87.6335 -81.7262
quadrupole: -2.6646 -8.6703 1.2747
quadrupole: 8.7104 -7.3088 -1.4016 -2.6646 -8.6703 1.2747
hfenergy: -667.2651816 hartree
pointgroup: C01 [X(C10H11N1O3)]
dipole: -0.2550087 0.5894403 1.7056683 debye
dipolederiv: -0.7424073 0.336326 0.2655653 0.3422655 -0.635877 -0.2380896 0.3305349 -0.3000468 -0.6404782 -0.6604169 -0.3110708 0.0473694 -0.1633111 -0.9235161 -0.1891953 0.1505724 -0.0859198 -0.4022804 -0.4540325 -0.0191797 0.1023461 0.1094512 -0.4661969 -0.1560115 0.1143951 0.2003311 -1.0345734 -0.6036127 -0.0678986 0.0064325 -0.0258482 -0.6578986 0.4737672 -0.0320231 0.3781911 -0.7584795 0.1327249 -0.009566 -0.0011119 -0.276138 -0.0170815 0.0850086 0.0864134 0.0517388 0.1488845 -0.0907925 -0.1223716 0.1135526 -0.0360429 0.4826283 -0.2144713 0.0909278 0.022087 0.0162427 0.2484497 0.0573025 0.0032987 0.2315398 0.000153 0.0045435 -0.1369213 0.0034552 -0.0502832 -0.1119441 -0.0077018 0.0673342 -0.0394688 -0.1430194 -0.0231787 0.1323479 0.0002813 -0.0173891 -0.1829996 0.020978 -0.0463571 0.0182562 -0.156278 -0.031008 -0.0034053 -0.0292357 0.0824126 1.2681083 0.1497815 -0.4030214 0.1506156 1.2220436 0.4698961 -0.6157373 0.4056546 0.588578 -0.027609 0.0411612 -0.0454659 0.0358244 -0.1321644 -0.0378592 -0.0755888 -0.0268361 0.1198583 0.0083982 0.042289 0.0750849 0.0147713 -0.1413156 0.0062629 0.0760237 0.0141303 0.0632549 0.0574154 0.0659207 -0.0309804 0.0575815 -0.149716 -0.0134796 -0.0237002 -0.0155725 -0.0791821 0.233473 0.0601632 -0.293174 -0.0947399 0.8130964 -0.1906979 -0.2519489 -0.420394 1.4948555 -0.0036347 0.0163068 0.0213329 0.0370964 0.0775903 -0.0614305 0.0581571 -0.0143491 -0.108061 -0.0169547 -0.0311168 -0.0159141 -0.0388047 -0.0910151 0.0220744 -0.0111086 -0.0124484 0.0700349 0.144788 0.0185233 0.0277506 -0.0045869 0.0762332 -0.000447 0.0014714 -0.0873031 0.0559789 0.3776536 0.0307682 0.0414326 0.0070659 0.1412815 0.0286867 0.0487536 -0.01188 0.1570408 0.0578728 -0.0467263 -0.07885 -0.0527043 0.1456917 0.0044422 -0.0831663 -0.0098336 0.0220202 0.0585825 -0.0296845 0.0961391 -0.0219285 0.1382651 0.0340227 0.0653468 0.0317176 -0.0861119 0.0569943 -0.023828 0.0494418 -0.030593 0.1444759 0.0351787 0.0757382 0.0313269 -0.0865165 -0.0153197 -0.0297272 -0.1035663 -0.0356201 0.1499761 -0.0150674 -0.1154864 -0.0144512 -0.0436652 -0.1195215 -0.0668812 0.0315199 -0.0706669 0.1435696 0.0140714 0.032996 0.014973 0.0832859 0.1321946 0.0383476 0.0342152 0.0499873 -0.2387461 -0.028965 0.0513767 -0.1165436 0.0347062 0.2525899 -0.1121157 0.0356255 -0.1640018 0.2178201 0.0219467 0.0340309 -0.009073 0.369867 unknown
polarizability: 145.1992642|14.7666299|88.8033347|-5.8640403|-6.8789733|119.4662639 unknown
InChI: InChI=1S/C10H11NO3/c12-7-11-9(10(13)14)6-8-4-2-1-3-5-8/h1-5,7,9,11,13H,6H2
charge 0 multiplicity 1
25 atoms
O  -3.527154 -0.037014 1.105286
O  -3.182434 -2.083911 0.057452
O  -0.909411 1.358003 -2.390569
N  -1.454937 1.130446 -0.12275
C  -0.345255 -0.951698 0.809251
C  -1.445185 -0.333853 -0.116572
C  1.079809 -0.494817 0.515515
C  1.553335 -0.281466 -0.804681
C  1.985834 -0.334204 1.595392
C  -2.789181 -0.927773 0.309239
C  2.901287 0.074292 -1.03432
C  3.335054 0.017658 1.367645
C  3.798985 0.221551 0.047906
C  -1.205839 1.860551 -1.270116
H  -0.595331 -0.723394 1.863811
H  -0.419969 -2.052053 0.698274
H  -1.267317 -0.651649 -1.159349
H  -1.747135 1.615418 0.728044
H  0.875095 -0.364814 -1.661082
H  1.632879 -0.489674 2.623066
H  3.246535 0.241894 -2.060536
H  4.019108 0.134553 2.21586
H  4.843685 0.497243 -0.134307
H  -1.289453 2.95653 -1.100428
H  -4.376005 -0.471618 1.389971
