program: Gaussian 09
title: 000100118
version: EM64L-G09RevD.01
frameworkgroup: C1[X(C16H17N3O3S)]
method: RPBEPBE
basis: SDD
operation: Freq
keyword: #p
keyword: freq=noraman
keyword: PBEPBE/SDD
title: #p freq=noraman PBEPBE/SDD
converged: YES YES NO NO
title: Mulliken charges:
elementType: S O O O N N N C C C C C C C C C C C C C C C C H H H H H H H H H H H H H H H H H
charge: 0.115276 -0.260211 -0.219652 -0.215783 -0.417419 -0.633654 0.019936 -0.162842 -0.671202 0.161220 -0.799359 0.501664 0.489689 -0.424877 -0.316340 -0.383167 -0.375354 0.391281 -0.344437 -0.362766 -0.218430 -0.217014 -0.233545 0.239018 0.285162 0.279317 0.256911 0.279796 0.313526 0.336260 0.280250 0.249309 0.315930 0.230938 0.238254 0.287111 0.285909 0.232329 0.232050 0.234917
chargesum: 0.00000
title: Mulliken charges with hydrogens summed into heavy atoms:
elementType: S O O O N N N C C C C C C C C C C C C C C C C
charge: 0.115276 -0.260211 -0.219652 -0.215783 -0.103893 -0.017145 0.019936 0.076176 -0.106723 0.161220 -0.262652 0.501664 0.489689 -0.175568 -0.000410 -0.152229 -0.137100 0.391281 -0.057326 -0.076858 0.013899 0.015036 0.001372
polarizability: 3.06906279e+02 -1.68951577e+01 2.94374590e+02 1.66419105e+01 8.45658576e+00 1.35961809e+02
1716.lowfreq: -8.0807 -5.2957 -0.0012 -0.0010 0.0013 4.9410 6.1025 21.5904 22.8665
frequency: -1.9518 21.4230 22.6899 34.0006 42.3774 67.0486 72.4333 83.1681 89.4165 109.1547 128.7536 172.6897 203.1512 219.0872 225.2332 230.2999 261.7653 292.2520 325.6600 329.4750 350.3441 367.9468 391.5061 402.0442 417.4162 452.9481 470.3487 507.5213 510.4174 553.4059 557.7139 613.7829 616.8693 633.3855 637.9603 640.3141 665.9646 669.4061 701.8369 710.7597 740.4874 769.3526 776.1861 803.2766 822.8679 829.4559 850.7223 855.0288 871.3575 881.9168 895.7087 914.5509 927.9684 978.3652 985.1382 989.9420 999.6821 1000.0328 1010.2610 1013.3370 1026.2315 1071.3478 1096.4775 1098.5659 1118.4315 1120.8599 1140.7820 1160.6203 1174.8070 1178.7414 1188.1388 1191.6928 1216.8206 1225.5727 1231.8496 1247.6782 1282.5335 1300.9646 1308.3076 1325.8285 1345.0886 1357.8795 1385.3668 1396.8139 1426.5071 1431.2719 1441.0948 1461.8969 1483.9266 1488.6887 1538.6368 1582.9334 1594.2747 1605.9921 1613.1841 1615.4998 1644.5842 2898.7729 3025.4469 3038.0085 3098.7837 3115.8831 3118.5583 3125.2123 3136.4744 3138.0707 3150.5594 3167.6132 3178.5131 3186.3396 3202.5634 3235.3847 3477.7419 3641.9052
redmass: 5.8124 4.0858 5.3225 5.4363 6.6669 7.5788 6.9873 5.0432 5.6650 5.3311 7.6117 8.5986 3.3938 4.5521 1.4306 3.9415 4.6754 4.7374 3.9205 2.5671 4.9510 5.3407 7.5435 2.7992 3.0279 5.8092 3.7793 4.8089 4.1050 3.7927 1.6125 4.1595 6.3144 5.5717 4.8532 4.5686 5.2831 4.7921 1.7029 3.1877 4.5436 7.7103 2.1077 3.5462 1.3222 4.8578 1.3035 1.8725 1.5528 1.5963 1.4658 2.3747 1.5186 1.3919 1.3429 6.1587 1.3224 3.1285 1.3651 4.3150 2.1999 1.4677 3.0263 1.3984 1.2859 1.1182 1.1679 2.5753 1.0526 1.4804 1.1234 2.3388 1.5898 4.4761 1.7903 1.3228 1.9361 1.5088 1.2667 1.2794 1.8775 4.3408 8.7023 5.8002 1.1201 4.3625 2.1854 1.1152 2.3513 2.6094 2.5080 2.4006 6.0746 2.1938 6.0560 5.4700 1.9932 1.0810 1.0569 1.0585 1.1085 1.1076 1.0882 1.0870 1.0912 1.0910 1.0960 1.1016 1.0906 1.0947 1.0959 1.0809 1.0483 1.0971
irintensity: 0.1233 0.0680 0.3270 0.1906 0.5414 2.4534 0.1235 0.8223 4.4977 1.8708 1.4969 6.1231 0.2063 9.0532 31.9461 7.3265 11.2583 3.2876 5.7711 2.3659 1.0766 4.7550 33.6357 0.0259 0.0461 0.9649 3.4735 1.5778 4.9865 68.4573 199.0168 41.4550 0.5415 19.6510 19.6021 36.1266 17.2673 23.4055 65.4304 20.1202 2.4796 19.1199 32.5172 9.0242 9.4116 1.0462 5.8365 12.8749 14.3842 91.8360 14.1234 14.8635 2.2554 0.0127 0.6545 0.6310 0.0695 0.0628 0.5946 15.9546 5.4962 9.8740 16.8639 17.1488 20.0401 3.0859 4.3359 71.7575 0.0569 270.7977 4.7176 37.5741 6.7697 461.3348 30.4636 0.2405 51.4406 58.3599 4.4571 0.3865 26.8086 77.9451 0.1664 119.1249 13.0331 33.3782 9.6961 3.9286 11.9642 36.0129 555.2714 211.3770 1.0721 93.5326 0.9490 119.8607 85.6604 47.4698 21.2111 18.8324 7.1964 4.9083 11.1469 3.8369 8.3679 8.7084 33.7402 20.2618 1.4196 2.2503 3.0347 691.8373 39.8387 30.0705
temp: 298.150 k
press: 1.00000 atm
elementType: 16 8 8 8 7 7 7 6 6 6 6 6 6 6 6 6 6 6 6 6 6 6 6 1 1 1 1 1 1 1 1 1 1 1 1 1 1 1 1 1
symmnumber: 1
zpe: 806123.5 jmol-1
zpe.correction: 0.307036 hartree
zpe.thermalcorrener: 0.328044 hartree
zpe.thermalcorrenthalpy: 0.328988 hartree
zpe.thermalcorrgfe: 0.254238 hartree
zpe.sumelectzpe: -1406.158083 hartree
zpe.sumelectthermal: -1406.137076 hartree
zpe.sumelectthermalent: -1406.136131 hartree
zpe.sumelectthermalfe: -1406.210882 hartree
dipole: -9.4627 1.7234 1.4736
dipole: 9.7306
quadrupole: -172.7594 -143.5464 -141.2543
quadrupole: 14.0661 0.5080 1.6710
quadrupole: -20.2393 8.9736 11.2657 14.0661 0.5080 1.6710
hfenergy: -1406.4651195 hartree
pointgroup: C01 [X(C16H17N3O3S1)]
dipole: -3.726729 -0.5017696 -0.7180314 debye
polarizability: 309.1276912|16.3875304|292.1703244|-10.1392353|15.0700652|135.9446621 unknown
InChI: InChI=1S/C16H17N3O3S/c17-15(11-23-10-12-4-2-1-3-5-12)16(20)18-13-6-8-14(9-7-13)19(21)22/h1-9,15,18H,10-11,17H2
charge 0 multiplicity 1
40 atoms
S  -2.358871 -0.910412 1.139061
O  1.166999 -3.574436 -0.676655
O  5.352748 2.731874 0.70016
O  6.541093 0.866488 0.134259
N  0.527666 -1.38139 -0.121589
N  -1.338295 -4.503139 -0.79177
N  5.427802 1.483653 0.364948
C  -1.240686 -3.075328 -0.521207
C  -2.029422 -2.756989 0.791499
C  0.271292 -2.709429 -0.440983
C  -3.791004 -0.598338 -0.109719
C  -4.009262 0.885114 -0.279046
C  1.775674 -0.727043 -0.007077
C  1.75069 0.649561 0.365931
C  3.023229 -1.370421 -0.253578
C  -3.301335 1.61038 -1.272972
C  -4.915283 1.581138 0.562144
C  4.170655 0.722838 0.238388
C  2.942138 1.376968 0.489961
C  4.217602 -0.640297 -0.129801
C  -3.497372 3.00035 -1.425921
C  -5.111793 2.972065 0.411987
C  -4.403232 3.685484 -0.582394
H  -1.6728 -2.451323 -1.339359
H  -1.493646 -3.14394 1.673977
H  -3.009258 -3.258953 0.738706
H  -3.502005 -1.080895 -1.057975
H  -4.675917 -1.105542 0.307407
H  -0.312749 -0.821764 0.122561
H  -0.432691 -4.963029 -0.928376
H  -2.095907 -4.81313 -1.397504
H  0.790303 1.141071 0.560273
H  3.034882 -2.424817 -0.532599
H  -2.598781 1.083433 -1.930815
H  -5.4647 1.031739 1.336147
H  2.944006 2.431611 0.77608
H  5.187539 -1.110152 -0.312968
H  -2.948973 3.547561 -2.200592
H  -5.815941 3.497068 1.066692
H  -4.556494 4.763772 -0.700581
