program: Gaussian 09
title: 000100117
version: EM64L-G09RevD.01
frameworkgroup: C1[X(C14H19NO5)]
method: RPBEPBE
basis: SDD
operation: Freq
keyword: #p
keyword: freq=noraman
keyword: PBEPBE/SDD
title: #p freq=noraman PBEPBE/SDD
converged: YES YES NO NO
title: Mulliken charges:
elementType: O O O O O N C C C C C C C C C C C C C C H H H H H H H H H H H H H H H H H H H
charge: -0.334231 -0.428301 -0.300373 -0.218803 -0.434056 -0.409198 0.339114 -0.160493 -0.618335 0.537806 -0.711157 -0.704793 -0.708006 0.344135 0.168311 -0.359346 -0.373583 -0.344811 -0.396625 0.285287 0.306342 0.221290 0.243009 0.218508 0.208206 0.271354 0.225010 0.227289 0.204174 0.274019 0.206760 0.215713 0.335226 0.234099 0.230160 0.249997 0.216762 0.387270 0.352268
chargesum: 0.00000
title: Mulliken charges with hydrogens summed into heavy atoms:
elementType: O O O O O N C C C C C C C C C C C C C C
charge: -0.334231 -0.041031 -0.300373 -0.218803 -0.081788 -0.073972 0.339114 0.145849 -0.154035 0.537806 -0.013089 -0.048319 -0.011514 0.344135 0.168311 -0.125247 -0.143423 -0.094813 -0.179864 0.285287
polarizability: 1.63369163e+02 1.37436880e+01 2.10436705e+02 1.88417326e+01 -5.08216687e+00 1.48191547e+02
1716.lowfreq: -4.0448 -0.0007 -0.0007 -0.0004 7.0351 9.0596 16.8459 26.2897 28.6029
frequency: 16.7080 26.0532 28.5329 35.0826 52.1594 56.9064 78.7079 95.5995 117.5751 128.2732 175.4734 181.0692 201.2259 241.1486 245.3952 269.1215 286.3648 298.4177 310.5380 331.9421 340.4612 352.9756 397.7409 405.3276 408.5947 411.9264 434.3700 449.0403 474.8039 524.6024 538.4406 562.1609 589.5896 598.5017 636.8110 680.7475 699.7404 700.7729 720.6280 731.9184 763.4259 801.2681 815.8840 825.3885 834.1972 864.2736 890.0332 914.5790 920.6201 930.3853 954.2600 960.6762 972.6379 1001.0552 1006.4226 1031.2061 1033.1751 1080.7034 1101.9262 1131.5139 1144.4113 1158.8798 1179.8790 1198.1261 1218.3857 1226.6800 1248.7077 1256.3569 1261.2716 1270.2901 1297.8538 1308.7715 1320.3438 1330.4746 1373.9450 1378.8875 1395.3577 1400.3081 1428.7040 1444.7842 1465.0743 1465.7153 1467.7211 1470.4446 1480.4242 1484.9018 1503.1208 1506.8144 1598.8525 1628.0665 1644.6087 1666.6828 2988.4754 2989.2951 2994.1273 2994.7632 3047.6995 3062.7527 3079.7411 3083.2785 3095.6775 3096.9739 3111.3700 3114.3237 3118.2302 3126.2722 3140.0067 3172.3212 3522.9584 3575.2726 3582.1361
redmass: 5.3914 3.7422 7.0615 3.8788 5.1125 5.6176 6.0761 4.7764 3.9391 6.0198 1.3338 2.9050 4.6580 1.0578 1.0747 4.3858 3.9278 3.3251 4.2051 2.6440 3.4946 1.1415 3.8653 2.8796 2.8411 2.9414 2.8495 2.8839 4.5822 2.8414 3.5316 1.4096 2.0265 1.7260 6.6580 3.4403 6.1282 11.8174 4.1638 4.6918 4.9285 1.4846 2.8528 3.0602 2.0380 2.6233 2.9369 1.5997 1.6303 1.4671 1.2048 1.3834 6.1274 2.9318 2.7248 1.4138 1.4280 2.2250 1.5447 2.2733 1.3858 2.0615 1.1200 1.6838 2.2330 1.9220 2.8731 3.0225 1.3975 2.9925 1.6988 1.3561 1.4635 1.3735 1.2302 1.2319 6.0322 1.2173 2.8114 1.0465 1.1883 1.0655 1.0652 1.0662 1.0525 1.6348 1.0809 2.6817 6.4629 6.4755 8.8245 9.0738 1.0363 1.0356 1.0589 1.0371 1.0911 1.0963 1.0995 1.0992 1.0994 1.1001 1.0878 1.0999 1.0991 1.0901 1.0960 1.0952 1.0642 1.0772 1.0660
irintensity: 0.1781 1.6966 1.9275 0.2425 3.8845 0.0623 2.4367 0.4398 2.1532 0.4845 0.2512 0.1153 6.6293 0.0422 0.2389 1.6061 1.6126 3.9527 13.6275 2.9556 0.1562 144.2394 1.5944 1.9146 12.3742 0.8862 3.2719 5.3393 16.1057 30.9776 8.9394 17.6999 207.3328 99.6128 1.4973 27.0889 13.1575 36.4197 6.4372 11.5918 7.2112 33.5179 9.7003 20.2342 20.9981 5.4934 46.7185 0.8072 1.9768 9.2861 0.5460 2.3442 156.4493 31.5471 11.6623 1.0520 6.3657 226.6532 81.2224 41.9625 182.3004 418.1644 10.8968 7.7376 1.2041 58.6923 35.3645 25.8406 9.5104 20.9930 61.9862 6.5104 26.7002 27.5365 42.6577 34.7547 12.8411 34.4024 10.3305 0.9948 119.8137 9.4120 12.5312 10.5201 3.7326 201.2857 44.1836 106.1595 13.3134 43.7583 194.1167 235.6477 24.1317 11.8099 33.4561 24.7149 4.2651 12.4740 11.6824 17.3446 56.2522 33.7211 17.8839 4.5584 14.7251 12.8529 13.7434 5.4032 32.0833 47.9203 37.4802
temp: 298.150 k
press: 1.00000 atm
elementType: 8 8 8 8 8 7 6 6 6 6 6 6 6 6 6 6 6 6 6 6 1 1 1 1 1 1 1 1 1 1 1 1 1 1 1 1 1 1 1
symmnumber: 1
zpe: 818183.5 jmol-1
zpe.correction: 0.311630 hartree
zpe.thermalcorrener: 0.333028 hartree
zpe.thermalcorrenthalpy: 0.333972 hartree
zpe.thermalcorrgfe: 0.258700 hartree
zpe.sumelectzpe: -974.269478 hartree
zpe.sumelectthermal: -974.248079 hartree
zpe.sumelectthermalent: -974.247135 hartree
zpe.sumelectthermalfe: -974.322407 hartree
dipole: 1.7451 -1.0341 4.2771
dipole: 4.7337
quadrupole: -117.0266 -107.4008 -118.4757
quadrupole: 1.8951 -1.8431 1.6518
quadrupole: -2.7256 6.9003 -4.1747 1.8951 -1.8431 1.6518
hfenergy: -974.5811072 hartree
pointgroup: C01 [X(C14H19N1O5)]
dipole: 0.5888096 0.5450661 -1.6806857 debye
polarizability: 166.0408762|-18.1754631|207.1536049|-19.333955|-4.498952|148.8029343 unknown
InChI: InChI=1S/C14H19NO5/c1-14(2,3)20-13(19)15-11(12(17)18)8-9-4-6-10(16)7-5-9/h4-7,11,15-17H,8H2,1-3H3
charge 0 multiplicity 1
39 atoms
O  2.271523 0.904128 -0.525834
O  1.768336 -3.543134 -1.096863
O  1.134539 0.304684 1.475191
O  0.594565 -4.448087 0.694507
O  -4.12723 2.727171 0.445773
N  1.101787 -1.026101 -0.456357
C  2.817103 2.214605 0.024569
C  0.2585 -2.069944 0.110912
C  -1.177437 -2.126478 -0.53965
C  -1.963566 -0.848421 -0.314529
C  3.738851 1.923385 1.225927
C  3.610179 2.755991 -1.177773
C  1.641597 3.142506 0.392401
C  1.469874 0.086659 0.280538
C  0.878974 -3.460074 -0.01275
C  -2.688331 -0.648062 0.890538
C  -1.972795 0.187013 -1.280173
C  -3.400264 0.541947 1.129461
C  -2.681463 1.38867 -1.058933
C  -3.394345 1.562803 0.150837
H  0.142857 -1.846335 1.186071
H  -1.056043 -2.327221 -1.621105
H  -1.702988 -2.992835 -0.096162
H  4.528345 1.20535 0.941039
H  4.225657 2.860802 1.552158
H  3.164946 1.509886 2.069916
H  2.945405 2.904791 -2.046269
H  4.408636 2.050691 -1.466258
H  4.072569 3.724848 -0.917563
H  1.065489 2.731585 1.236013
H  2.03285 4.136506 0.677189
H  0.967469 3.270247 -0.473436
H  1.50377 -1.14942 -1.386239
H  -2.695253 -1.434981 1.654741
H  -1.421668 0.056101 -2.218793
H  -3.960017 0.699643 2.055841
H  -2.679587 2.177899 -1.822359
H  2.117366 -4.472249 -1.168827
H  -4.054704 3.38443 -0.290048
