program: Gaussian 09
title: 000009186
version: EM64L-G09RevD.01
frameworkgroup: C1[X(C26H16)]
method: RPBEPBE
basis: SDD
operation: Freq
keyword: #p
keyword: freq=noraman
keyword: PBEPBE/SDD
title: #p freq=noraman PBEPBE/SDD
converged: NO YES NO YES
title: Mulliken charges:
elementType: C C C C C C C C C C C C C C C C C C C C C C C C C C H H H H H H H H H H H H H H H H
charge: 0.445814 0.445811 0.249960 0.249964 0.477835 0.477838 -0.639741 -0.639741 -0.735206 -0.735206 0.196544 0.196545 0.417963 0.417961 -0.504296 -0.504295 -0.475189 -0.475192 -0.368874 -0.368873 -0.434739 -0.434737 -0.261377 -0.261379 -0.249988 -0.249986 0.233976 0.233975 0.250164 0.250164 0.241477 0.241477 0.234380 0.234381 0.223967 0.223966 0.239646 0.239646 0.227967 0.227967 0.229716 0.229715
chargesum: 0.00000
title: Mulliken charges with hydrogens summed into heavy atoms:
elementType: C C C C C C C C C C C C C C C C C C C C C C C C C C
charge: 0.445814 0.445811 0.249960 0.249964 0.477835 0.477838 -0.405766 -0.405766 -0.485042 -0.485043 0.196544 0.196545 0.417963 0.417961 -0.262819 -0.262818 -0.240809 -0.240811 -0.144907 -0.144907 -0.195092 -0.195091 -0.033410 -0.033412 -0.020272 -0.020270
polarizability: 7.02654667e+02 9.17816912e+00 2.96646411e+02 2.38680811e-03 4.63398891e-04 1.02832394e+02
1716.lowfreq: -0.0012 -0.0003 0.0013 1.7771 5.5767 17.7676 31.7902 49.6917 87.9130
frequency: 31.7902 49.6917 87.9064 93.9221 103.7493 138.4177 166.2163 188.6034 221.7380 244.2353 268.1225 307.7332 310.0638 350.7402 392.1879 421.4903 424.7745 429.8284 430.7608 445.6258 464.1215 497.8122 510.2645 523.0582 527.0589 541.4853 548.6779 569.3574 599.2052 599.4400 632.2207 681.9020 697.9606 706.0141 715.6462 724.3969 757.0291 758.6559 765.8584 780.2773 785.6301 802.0309 802.1894 818.7906 825.1702 827.3525 869.5512 870.5267 872.8896 887.7021 891.7469 897.1413 928.7328 946.8146 957.1318 958.0275 965.2773 983.5565 984.5527 990.2215 992.3460 992.5549 1041.1769 1041.8500 1098.0504 1109.1436 1152.3149 1156.1063 1178.0295 1178.1220 1192.8359 1199.2917 1223.5011 1232.2344 1239.0729 1243.0009 1248.0224 1267.3706 1293.4987 1294.2341 1304.9017 1326.4010 1372.8568 1383.7520 1395.8910 1401.4061 1417.7780 1421.6737 1434.9128 1443.7283 1451.2042 1457.5452 1460.6680 1493.7913 1505.9236 1538.4061 1561.0745 1561.4431 1589.9610 1610.4641 1619.0107 1619.0408 1632.7454 1634.8732 3114.1095 3114.1380 3116.9053 3117.1464 3120.8074 3120.8316 3130.4035 3130.9052 3136.0480 3136.6892 3141.7486 3142.0167 3149.7203 3149.7860 3164.6096 3164.7595
redmass: 5.8766 4.3491 4.5387 5.5285 4.3357 4.3768 6.0927 4.5288 4.2119 4.3284 6.2356 3.8464 5.6026 4.7409 3.1960 4.6434 2.9765 3.0248 6.0467 6.9702 2.4814 4.9670 5.5962 7.2897 3.2666 3.6571 2.9395 3.1314 6.9919 7.5657 6.9521 3.7053 5.9180 5.8149 2.8517 6.6030 1.2588 1.2915 5.7649 2.4034 6.1675 2.0587 1.9702 4.6786 1.5892 1.3892 4.1050 1.4143 3.7302 1.5997 1.8728 2.0721 1.6033 2.0886 1.4422 1.4075 6.5566 1.3706 1.3958 4.1499 1.3916 1.3839 2.1699 2.1822 2.3820 2.0101 1.4138 1.3822 1.0798 1.0801 1.4380 1.3354 2.0953 1.8966 2.0296 2.9497 1.9514 1.3667 1.6034 1.8314 1.9829 3.0530 4.1896 4.2418 3.3865 4.0382 2.4831 2.8533 2.8928 8.5763 3.3916 2.8145 2.6417 3.2816 3.8594 4.4692 6.0845 7.3655 5.9480 5.7820 6.6692 6.4049 6.9749 7.0305 1.0905 1.0898 1.0871 1.0872 1.0866 1.0866 1.0893 1.0887 1.0900 1.0902 1.0984 1.0981 1.0928 1.0927 1.0999 1.0999
irintensity: 0.2756 0.1449 0.0000 0.2314 0.0000 0.0402 0.0000 4.6462 0.0000 0.0000 0.0000 4.7344 0.4542 0.5976 0.0000 0.0000 0.0000 13.6730 9.1523 0.0000 9.9808 0.3091 1.0128 0.0000 0.0000 0.5156 0.0000 12.0103 5.2016 0.0000 7.5756 0.0000 1.5059 0.0000 14.7415 0.0000 0.0002 110.1807 2.0239 0.0000 0.0000 0.0001 1.2667 0.0000 0.0000 83.2160 13.7205 0.0000 0.0000 7.7931 0.0000 2.1017 99.5699 0.0000 0.0001 25.2499 3.3148 0.6887 0.0000 0.0000 0.0000 0.0373 0.0000 16.2238 0.0000 11.8677 0.0000 2.0955 2.5654 0.0001 7.5439 0.0000 4.2540 0.0000 0.0000 3.3477 18.0938 0.0000 3.7468 0.0000 1.5409 2.6148 0.0000 6.4465 0.0000 1.0727 0.0000 8.1459 0.0000 0.0000 1.7819 0.0000 15.2114 45.6389 0.0000 0.0000 6.2537 0.0000 0.7745 0.0000 0.0003 0.3455 1.5551 0.0000 11.1431 0.1087 7.5477 0.0000 9.8909 0.4490 16.7666 0.0013 7.9933 0.0003 74.6702 0.0008 65.6536 1.0255 94.6942 0.0667
temp: 298.150 k
press: 1.00000 atm
elementType: 6 6 6 6 6 6 6 6 6 6 6 6 6 6 6 6 6 6 6 6 6 6 6 6 6 6 1 1 1 1 1 1 1 1 1 1 1 1 1 1 1 1
symmnumber: 1
zpe: 865713.0 jmol-1
zpe.correction: 0.329733 hartree
zpe.thermalcorrener: 0.347475 hartree
zpe.thermalcorrenthalpy: 0.348419 hartree
zpe.thermalcorrgfe: 0.284316 hartree
zpe.sumelectzpe: -998.737773 hartree
zpe.sumelectthermal: -998.720031 hartree
zpe.sumelectthermalent: -998.719087 hartree
zpe.sumelectthermalfe: -998.783190 hartree
dipole: 0.0000 0.0000 0.0000
dipole: 0.0000
quadrupole: -123.9670 -126.2735 -161.7090
quadrupole: 0.5085 0.0004 0.0001
quadrupole: 13.3495 11.0430 -24.3925 0.5085 0.0004 0.0001
hfenergy: -999.067506 hartree
pointgroup: C01 [X(C26H16)]
dipole: -0.0000003 0.0000005 -0.0000031 debye
polarizability: 702.6262863|-9.7857481|296.6747919|-0.0023861|0.000467|102.8323938 unknown
InChI: InChI=1S/C26H16/c1-3-7-23-17(5-1)9-11-19-13-22-16-26-20(14-21(22)15-25(19)23)12-10-18-6-2-4-8-24(18)26/h1-16H
charge 0 multiplicity 1
42 atoms
C  0.207479 -0.699196 0.000017
C  -0.207489 0.699216 0.000025
C  2.595018 -0.020115 0.00001
C  -2.595028 0.02014 0.00002
C  -2.173616 -1.38044 0.000019
C  2.173606 1.380462 0.000013
C  1.599061 -1.013497 0.00001
C  -1.599072 1.013519 0.00003
C  -0.802266 -1.702291 0.000019
C  0.802255 1.702311 0.000024
C  4.036613 -0.329501 -0.000008
C  -4.036624 0.329524 0.000012
C  4.989788 0.752086 -0.000002
C  -4.989798 -0.752059 0.00003
C  -3.178571 -2.426411 0.000025
C  3.178559 2.426432 0.000016
C  -4.522977 -2.126989 0.000037
C  4.522965 2.127015 0.000014
C  4.539475 -1.663519 -0.000032
C  -4.539484 1.663542 -0.000008
C  6.387102 0.465016 -0.000015
C  -6.387113 -0.46499 0.000034
C  5.919051 -1.928169 -0.000049
C  -5.919059 1.928196 0.000003
C  6.854138 -0.857426 -0.000042
C  -6.854145 0.85745 0.000019
H  1.875858 -2.073375 0.000002
H  -1.875863 2.0734 0.000037
H  -0.505171 -2.758822 0.000019
H  0.505164 2.758844 0.000035
H  -2.840623 -3.469546 0.000029
H  2.84061 3.469567 0.000024
H  -5.271624 -2.928241 0.000052
H  5.271611 2.928267 0.000018
H  3.845607 -2.510005 -0.000041
H  -3.845609 2.510025 -0.000026
H  7.096559 1.301429 -0.000013
H  -7.096567 -1.301407 0.000051
H  6.274161 -2.964584 -0.00007
H  -6.274173 2.964609 -0.000009
H  7.929597 -1.065344 -0.000056
H  -7.929604 1.065376 0.000027
