program: Gaussian 09
title: 000100114
version: EM64L-G09RevD.01
frameworkgroup: C1[X(C20H20N2O5)]
method: RPBEPBE
basis: SDD
operation: Freq
keyword: #p
keyword: freq=noraman
keyword: PBEPBE/SDD
title: #p freq=noraman PBEPBE/SDD
converged: YES YES NO NO
title: Mulliken charges:
elementType: O O O O O N N C C C C C C C C C C C C C C C C C C C C H H H H H H H H H H H H H H H H H H H H
charge: -0.291604 -0.295857 -0.440142 -0.214047 -0.273967 -0.412554 -0.632039 -0.417852 0.293382 0.336761 0.169168 0.159358 -0.328243 -0.458244 -0.445229 -0.413647 -0.399352 -0.232789 -0.243939 -0.248194 -0.236618 -0.155586 -0.398837 0.307044 -0.516695 0.138354 0.273113 0.248289 0.257516 0.223088 0.268302 0.238071 0.237296 0.238842 0.265027 0.225000 0.225046 0.225097 0.299117 0.295336 0.241992 0.369904 0.271139 0.211826 0.391747 0.312935 0.332682
chargesum: 0.00000
title: Mulliken charges with hydrogens summed into heavy atoms:
elementType: O O O O O N N C C C C C C C C C C C C C C C C C C C C
charge: -0.291604 -0.295857 -0.048395 -0.214047 -0.273967 -0.042650 0.013578 -0.169562 0.293382 0.336761 0.169168 0.159358 0.152361 -0.189942 -0.207158 -0.176351 -0.160510 0.032238 -0.018939 -0.023148 -0.011521 0.143531 0.138491 0.307044 -0.033730 0.138354 0.273113
polarizability: 2.74894621e+02 -5.41580110e+01 2.19281377e+02 -2.82763958e+01 -9.47721833e+00 2.24066694e+02
1716.lowfreq: -6.5222 -5.4181 -0.0006 0.0005 0.0007 6.3074 17.8692 22.2069 26.7975
frequency: 17.6984 21.9713 26.7616 33.6936 37.8446 60.8569 63.4413 80.3332 84.7478 90.7879 99.7337 112.6667 135.7901 154.8087 181.6112 194.0638 205.4222 226.6738 255.6950 282.2911 297.8055 329.6337 378.2367 409.3115 413.5076 417.6199 444.3310 447.2521 464.5476 490.6440 509.3073 522.6985 528.3826 557.7461 561.7617 571.9713 575.7929 585.7532 602.1929 617.8370 639.5388 654.6462 664.6857 682.0360 697.4633 717.2890 721.8443 744.1507 752.5956 765.3697 776.2997 789.5333 797.1754 798.8547 835.2593 873.7852 878.5602 884.0539 907.4319 915.8047 945.6306 955.1717 976.0454 983.5557 991.1062 996.7159 1007.8939 1017.9235 1022.8105 1033.4731 1046.1992 1052.0185 1075.5932 1091.0105 1103.7827 1113.7101 1141.0201 1158.5635 1169.8848 1176.2072 1182.5014 1185.9797 1193.7510 1203.9058 1222.7614 1241.8996 1256.0014 1260.8588 1269.1579 1282.3685 1297.3410 1304.2791 1308.0187 1324.0427 1349.8089 1362.8757 1375.5972 1378.5425 1403.5955 1439.1620 1442.8289 1445.6793 1466.9567 1468.8541 1470.5909 1479.9318 1485.3559 1590.3644 1593.0394 1595.6786 1618.3564 1621.2591 1640.6647 1659.8214 1674.2214 2953.7216 2973.2512 3000.0250 3018.9389 3025.4270 3032.1607 3086.1361 3097.5682 3116.7562 3121.3493 3125.8713 3137.4954 3140.3283 3144.2113 3160.1590 3169.8330 3515.4788 3527.1366 3564.5294 3672.7062
redmass: 5.0402 6.3867 5.5310 6.5792 8.7479 8.4481 5.6782 5.8976 8.2424 3.4622 4.0948 5.1100 4.1480 4.6972 4.7277 5.4991 4.3567 4.6127 6.3840 3.8999 3.6763 4.8373 4.2081 6.2586 2.7953 3.0579 3.6392 3.3943 4.1923 1.3440 4.8381 1.7533 3.0667 4.5531 4.0665 3.5755 3.1272 1.9101 1.2054 6.8352 1.6116 4.7405 1.9276 4.4599 7.8151 5.0656 4.7919 1.6458 1.6143 3.4106 1.8370 2.5576 2.7368 2.6438 3.0160 1.8397 1.6750 2.0451 3.6974 3.1946 1.4555 1.4779 3.7645 1.3287 1.3713 5.8941 2.1863 2.3379 2.2816 2.7369 2.1816 2.0063 2.7815 2.0131 1.8881 1.6770 2.9678 1.3304 1.1275 1.2382 1.4479 1.6374 1.6872 1.9074 1.3100 1.8258 2.0181 1.3645 1.5608 1.4997 1.3161 1.9195 1.5442 1.9902 1.4865 1.3185 2.1216 7.7391 3.8620 2.2173 1.1022 2.5879 1.1093 1.3628 2.2873 1.7791 2.9723 6.5088 6.9078 1.4933 7.2773 7.0321 3.2504 9.4504 9.0951 1.0807 1.0586 1.0814 1.0577 1.0728 1.0900 1.1079 1.1026 1.0869 1.0868 1.0882 1.0896 1.0940 1.0951 1.1001 1.0987 1.0446 1.0644 1.0777 1.1042
irintensity: 4.5868 0.6628 4.2374 2.3769 2.0429 5.8710 4.3273 1.7285 6.9507 1.1436 1.3280 4.4002 6.2989 3.6773 6.7269 2.3791 0.7583 0.8251 0.3671 5.9316 1.0638 6.9688 12.7649 0.0687 5.9863 8.7473 1.8294 0.3024 2.7780 71.3940 0.4562 131.4684 78.2801 14.6429 3.6548 2.0947 22.0563 52.7291 58.0663 5.9623 126.0268 2.1097 51.5320 30.1573 67.1712 1.2173 3.0434 8.5244 149.9354 19.7636 16.6406 0.6856 15.1597 2.0445 3.0458 4.3530 2.5510 4.0853 10.5551 21.9975 1.9928 5.6687 132.0042 0.8628 0.3334 4.6335 60.2902 5.0707 6.2653 69.2373 83.2824 55.6227 30.4583 53.1947 13.6585 0.0678 55.7103 4.3519 2.3386 1.6737 3.3466 33.4556 23.5153 96.0223 0.8618 1.4753 1.7616 4.0773 61.4624 33.4817 19.5026 1.6148 1.3899 41.4853 46.8834 7.0312 70.4407 11.8881 1.0888 27.1217 3.0533 10.3820 69.5022 79.4425 39.9768 265.8711 54.9374 0.6534 0.3752 52.1515 1.6512 1.6036 227.7144 220.5588 222.9077 8.0720 17.1023 11.8324 45.3230 9.4605 22.3168 8.6952 8.2053 7.5640 10.9664 1.7293 1.3764 20.0625 34.1569 39.7778 8.3496 34.8886 31.8433 65.0407 21.8850
temp: 298.150 k
press: 1.00000 atm
elementType: 8 8 8 8 8 7 7 6 6 6 6 6 6 6 6 6 6 6 6 6 6 6 6 6 6 6 6 1 1 1 1 1 1 1 1 1 1 1 1 1 1 1 1 1 1 1 1
symmnumber: 1
zpe: 964950.1 jmol-1
zpe.correction: 0.367530 hartree
zpe.thermalcorrener: 0.392177 hartree
zpe.thermalcorrenthalpy: 0.393121 hartree
zpe.thermalcorrgfe: 0.309750 hartree
zpe.sumelectzpe: -1257.866804 hartree
zpe.sumelectthermal: -1257.842157 hartree
zpe.sumelectthermalent: -1257.841213 hartree
zpe.sumelectthermalfe: -1257.924584 hartree
dipole: 0.8307 -0.3169 -5.6106
dipole: 5.6806
quadrupole: -158.1715 -149.6815 -144.5350
quadrupole: -11.6973 18.2654 -8.8539
quadrupole: -7.3755 1.1145 6.2610 -11.6973 18.2654 -8.8539
hfenergy: -1258.2343343 hartree
pointgroup: C01 [X(C20H20N2O5)]
dipole: 0.2819912 -0.772105 -2.0782656 debye
polarizability: 255.1956145|-66.1205439|235.2566586|-12.1862318|-7.1536683|227.7904184 unknown
InChI: InChI=1S/C20H20N2O5/c21-18(23)10-9-17(19(24)25)22-20(26)27-11-16-14-7-3-1-5-12(14)13-6-2-4-8-15(13)16/h1-8,16-17,22,24H,9-11,21H2
charge 0 multiplicity 1
47 atoms
O  0.35324 -1.608646 1.327069
O  -1.294727 -0.549357 2.661692
O  -3.154922 -2.631291 -1.310339
O  -5.228205 -1.92739 -0.534499
O  -3.084418 3.266507 0.058705
N  -1.767893 -1.425456 0.54058
N  -3.482499 3.05044 -2.212034
C  2.386415 -0.203437 1.580991
C  1.705163 0.951304 0.840499
C  3.262908 -0.823197 0.489814
C  2.163137 1.004948 -0.510552
C  3.129125 -0.089928 -0.726441
C  1.407814 -1.179006 2.273268
C  0.743082 1.862996 1.307623
C  4.12302 -1.931031 0.566264
C  1.672041 1.990892 -1.394396
C  3.862385 -0.466216 -1.873144
C  0.2370 2.843438 0.416614
C  4.856673 -2.312487 -0.586044
C  0.704769 2.908568 -0.920199
C  4.726651 -1.583752 -1.794442
C  -3.198039 -1.105794 0.594243
C  -3.511045 0.415191 0.425819
C  -0.946537 -1.132618 1.600653
C  -3.02479 0.999394 -0.914877
C  -3.985348 -1.911906 -0.433862
C  -3.204173 2.522947 -0.959735
H  3.035481 0.194977 2.391699
H  0.922039 -0.709051 3.147225
H  1.927375 -2.100232 2.587388
H  0.364206 1.810294 2.334094
H  4.234775 -2.498619 1.498098
H  2.026395 2.044913 -2.430349
H  3.768696 0.093651 -2.810657
H  -0.540718 3.536205 0.753372
H  5.53076 -3.175285 -0.542526
H  0.305697 3.677473 -1.591766
H  5.302888 -1.890172 -2.674861
H  -3.589594 -1.391188 1.591142
H  -3.026025 0.956414 1.255283
H  -4.602786 0.549328 0.532446
H  -1.39115 -1.932368 -0.26205
H  -1.941306 0.793883 -1.029994
H  -3.544907 0.52756 -1.77163
H  -3.71149 -3.139671 -1.959394
H  -3.601123 2.46257 -3.035009
H  -3.58304 4.061604 -2.302382
