program: Gaussian 09
title: 000102214
version: EM64L-G09RevD.01
frameworkgroup: C1[X(C16H9F21O2)]
method: RPBEPBE
basis: SDD
operation: Freq
keyword: #p
keyword: freq=noraman
keyword: PBEPBE/SDD
title: #p freq=noraman PBEPBE/SDD
converged: YES YES NO NO
title: Mulliken charges:
elementType: F F F F F F F F F F F F F F F F F F F F F O O C C C C C C C C C C C C C C C C H H H H H H H H H
charge: -0.118174 -0.113109 -0.132872 -0.113725 -0.111106 -0.126549 -0.133265 -0.115134 -0.118083 -0.113687 -0.136428 -0.120104 -0.116964 -0.114027 -0.160765 -0.165703 -0.122033 -0.119450 -0.126874 -0.119708 -0.120349 -0.278589 -0.236920 0.226204 0.217241 0.229460 0.263101 0.219567 0.222855 0.261970 0.290025 0.220210 -0.501843 -0.267478 0.370578 0.168392 0.339823 -0.754080 -0.622616 0.267308 0.276767 0.256598 0.259871 0.240054 0.240113 0.219829 0.232507 0.257160
chargesum: 0.00000
title: Mulliken charges with hydrogens summed into heavy atoms:
elementType: F F F F F F F F F F F F F F F F F F F F F O O C C C C C C C C C C C C C C C C
charge: -0.118174 -0.113109 -0.132872 -0.113725 -0.111106 -0.126549 -0.133265 -0.115134 -0.118083 -0.113687 -0.136428 -0.120104 -0.116964 -0.114027 -0.160765 -0.165703 -0.122033 -0.119450 -0.126874 -0.119708 -0.120349 -0.278589 -0.236920 0.226204 0.217241 0.229460 0.263101 0.219567 0.222855 0.261970 0.290025 0.220210 0.042233 0.248992 0.370578 0.168392 0.339823 -0.054085 -0.132948
polarizability: 2.09400580e+02 2.88719926e+01 1.92358031e+02 6.18914791e-01 -1.47247949e+00 1.74545162e+02
1716.lowfreq: -3.8300 -2.5816 -0.0005 0.0004 0.0006 2.8355 7.3486 14.8246 17.6695
frequency: 6.9819 14.7337 17.6547 19.9025 27.0056 29.4082 42.4504 50.5040 52.3245 62.0466 65.6081 69.9923 84.4256 92.5361 96.7286 103.4914 112.4902 128.2284 141.9698 148.9295 151.4804 158.5004 160.6059 174.1574 176.1180 188.2283 194.0944 201.4706 216.4661 224.3953 233.4477 236.3429 245.6580 252.6844 260.0882 267.6498 273.8938 280.5278 291.6013 293.5675 294.9834 299.9630 305.2585 312.2451 319.2586 324.8560 332.0592 333.5492 341.8057 353.0420 369.3316 373.6285 391.2260 394.3774 409.9921 420.1639 434.0370 455.6627 468.0450 484.3863 494.7094 504.7740 513.9293 524.1149 544.6113 551.8557 562.4834 577.1248 584.6307 585.5826 596.5014 631.2406 639.3305 651.3412 672.9261 713.7987 783.1670 788.2580 811.5555 827.1832 860.9189 896.4668 917.8059 927.0375 945.9938 969.4656 977.7478 994.8079 1004.5553 1009.0585 1009.4040 1011.2570 1013.8595 1019.3653 1026.7373 1031.4067 1038.9691 1041.8119 1050.4623 1053.5765 1054.9556 1078.0875 1084.8617 1088.9374 1092.4456 1103.0757 1104.9792 1112.6862 1127.8581 1138.2252 1153.8145 1159.3560 1180.4711 1189.0861 1190.5602 1193.1102 1207.1935 1286.3287 1288.3821 1326.0985 1391.0821 1398.4077 1417.5225 1446.5176 1458.2150 1472.6643 1485.0648 1616.5896 1653.4421 2991.0152 3028.4707 3040.1209 3073.8843 3089.6580 3100.4167 3105.9184 3111.3137 3217.9870
redmass: 9.2739 11.8666 7.5180 5.3005 15.8044 9.3443 7.1475 7.7983 9.7040 16.4049 14.4740 5.7662 11.9702 5.7916 5.1715 14.7868 8.9451 15.2607 11.6640 15.3753 6.6710 8.4290 3.5055 5.7510 1.2613 17.7204 17.9256 17.5886 17.9109 18.1003 17.9118 18.4256 13.9429 18.3213 17.4120 16.5283 10.0086 17.3571 17.2943 7.6849 10.6239 18.1089 17.1509 16.0707 11.2378 17.4699 11.3029 10.3178 16.6278 10.3149 5.3261 3.2861 4.8971 5.7389 8.3283 15.4439 13.8609 16.8397 16.8098 6.6655 12.3973 16.6229 15.5945 10.5645 14.6496 14.5935 16.0702 7.2631 17.1149 5.7481 16.8808 1.5304 17.7417 16.4085 14.2534 7.0973 1.8746 1.4552 9.0612 10.5009 10.8399 9.6288 2.7492 3.5440 4.2725 5.9087 8.9158 1.3141 12.8740 7.1508 1.4660 11.5890 12.2352 13.0338 12.3251 12.5384 12.2579 12.0309 12.6960 1.5065 11.8411 12.0378 12.9175 5.2432 8.7943 11.6066 5.0754 2.4780 7.6999 12.4099 11.2519 11.7979 11.1877 4.2006 10.3375 11.7671 1.2221 1.1983 2.8000 1.5407 1.5395 1.1704 1.2515 1.0867 1.0450 1.0601 1.0758 10.9793 5.2359 1.0363 1.0583 1.0590 1.0972 1.1052 1.1005 1.0621 1.1053 1.1158
irintensity: 0.0115 0.0731 0.2862 1.1373 0.0107 0.0500 0.2177 0.0862 0.2378 0.2142 0.1065 3.2144 0.0944 0.1177 0.3750 0.1800 0.1619 1.7113 0.5369 0.3403 3.1197 0.6249 4.7747 4.0328 1.7646 3.3411 9.9656 4.6683 2.6652 10.5322 1.2771 3.0084 1.9635 0.3698 0.1604 1.4678 1.4626 0.7625 1.4704 3.2897 1.5876 0.2867 0.2370 2.6729 0.6790 0.8283 1.4425 0.6890 1.1463 10.6945 11.5943 3.9923 4.7304 4.9976 0.8576 5.6760 3.6571 9.7477 2.7478 14.8562 19.8744 12.0819 4.8743 1.2084 12.0797 19.0736 12.6576 0.7001 8.4740 7.7517 13.5870 10.4118 6.2677 105.8475 160.8085 14.9660 5.3561 5.0862 67.0755 4.7098 162.8099 27.4639 95.4039 2.0422 34.8569 45.7662 24.3310 58.1326 33.9834 11.3769 19.5577 7.6618 80.3143 29.6809 110.2164 5.8468 106.0464 38.5556 90.3183 6.4091 236.4643 276.1649 178.0121 394.7320 154.5334 53.8970 362.1288 51.8825 11.7809 16.5833 49.5657 15.5741 1.7332 11.3916 31.9585 6.6167 6.8927 10.8965 76.5832 46.5884 16.2439 25.6180 10.5007 13.1408 16.1178 39.3604 8.0057 143.1579 6.1494 14.6050 7.2309 3.5328 15.7765 3.4203 26.1272 3.8587 7.1061 4.6325
temp: 298.150 k
press: 1.00000 atm
elementType: 9 9 9 9 9 9 9 9 9 9 9 9 9 9 9 9 9 9 9 9 9 8 8 6 6 6 6 6 6 6 6 6 6 6 6 6 6 6 6 1 1 1 1 1 1 1 1 1
symmnumber: 1
zpe: 657257.6 jmol-1
zpe.correction: 0.250336 hartree
zpe.thermalcorrener: 0.290891 hartree
zpe.thermalcorrenthalpy: 0.291835 hartree
zpe.thermalcorrgfe: 0.172192 hartree
zpe.sumelectzpe: -2859.130211 hartree
zpe.sumelectthermal: -2859.089655 hartree
zpe.sumelectthermalent: -2859.088711 hartree
zpe.sumelectthermalfe: -2859.208355 hartree
dipole: 1.8068 1.6510 2.9227
dipole: 3.8121
quadrupole: -208.2587 -225.4972 -229.0583
quadrupole: 8.5650 16.1134 6.1040
quadrupole: 12.6794 -4.5591 -8.1202 8.5650 16.1134 6.1040
hfenergy: -2859.3805468 hartree
pointgroup: C01 [X(C16H9F21O2)]
dipole: 0.7661457 0.2587758 1.2631183 debye
polarizability: 212.904354|26.4647899|188.7542951|7.7479879|2.2710118|174.6451237 unknown
InChI: InChI=1S/C16H9F21O2/c1-5(2)6(38)39-4-3-7(17,18)8(19,20)9(21,22)10(23,24)11(25,26)12(27,28)13(29,30)14(31,32)15(33,34)16(35,36)37/h1,3-4H2,2H3
charge 0 multiplicity 1
48 atoms
F  -1.806788 -2.587757 -0.10847
F  -0.594173 -1.43112 -1.661315
F  0.843313 -0.242028 0.702917
F  -0.250833 -1.828574 1.927777
F  -1.31384 0.937012 -0.768081
F  -1.955474 0.164354 1.283287
F  2.244151 -2.494275 1.435864
F  0.729676 -3.864827 0.397345
F  -3.373605 -1.000691 -1.829984
F  -4.123372 -1.093151 0.330353
F  3.234907 -3.598183 -0.729427
F  1.47081 -3.040037 -2.055506
F  -5.522303 0.556117 -1.323492
F  -3.650082 1.699399 -1.942796
F  3.719122 -1.629592 -2.581387
F  2.041871 -0.316861 -1.759589
F  -3.262117 2.589867 0.678775
F  -5.249108 3.109835 -0.326999
F  -4.533547 0.764595 2.351203
F  -5.588998 2.767274 2.315575
F  -6.499198 0.993297 1.234472
O  5.619466 0.92574 0.211057
O  6.490521 2.556308 -1.206295
C  -1.022801 -1.431446 -0.320018
C  0.228184 -1.51807 0.63332
C  -1.921632 -0.143225 -0.095673
C  1.349469 -2.597492 0.331763
C  -3.408334 -0.303921 -0.598868
C  2.250692 -2.594833 -0.970775
C  -4.256723 1.004297 -0.874397
C  3.02426 -1.29054 -1.376312
C  -4.509204 2.064297 0.267993
C  3.994247 -0.721721 -0.354935
C  4.78324 0.467259 -0.924315
C  -5.297837 1.628195 1.559408
C  6.46352 2.020357 -0.072978
C  7.26802 2.407007 1.130357
C  7.087175 1.630704 2.418135
C  8.12793 3.453597 0.9864
H  3.43813 -0.392912 0.538866
H  4.691734 -1.518299 -0.043386
H  4.125213 1.290142 -1.253478
H  5.432897 0.179837 -1.768194
H  6.042253 1.68652 2.772595
H  7.313149 0.559292 2.271912
H  7.74853 2.02624 3.207085
H  8.751207 3.796949 1.818849
H  8.214281 3.977066 0.027961
