program: Gaussian 09
title: 000102178
version: EM64L-G09RevD.01
frameworkgroup: C1[X(C21H28O4)]
method: RPBEPBE
basis: SDD
operation: Freq
keyword: #pfreq=noraman
keyword: PBEPBE/SDD
title: #p freq=noraman PBEPBE/SDD
converged: YES YES NO NO
title: Mulliken charges:
elementType: O O O O C C C C C C C C C C C C C C C C C C C C C H H H H H H H H H H H H H H H H H H H H H H H H H H H H
charge: -0.464861 -0.195281 -0.201307 -0.235932 -0.114107 0.288593 -0.160758 -0.263378 0.153587 0.207739 -0.554477 -0.641169 -0.532325 -0.473069 0.143976 -0.799029 0.543525 -0.641721 -0.486749 -0.803973 0.109616 -0.564262 -0.585921 0.178779 -0.770974 0.263292 0.250217 0.233074 0.224041 0.241765 0.276167 0.241156 0.277705 0.209455 0.229338 0.219030 0.236190 0.246322 0.236349 0.225707 0.236965 0.202985 0.265460 0.227389 0.207237 0.274716 0.339156 0.247099 0.233695 0.254350 0.241947 0.271830 0.250842
chargesum: 0.00000
title: Mulliken charges with hydrogens summed into heavy atoms:
elementType: O O O O C C C C C C C C C C C C C C C C C C C C C
charge: -0.125705 -0.195281 -0.201307 -0.235932 0.149185 0.288593 0.089459 -0.030304 0.153587 0.207739 -0.088671 -0.123846 -0.045166 -0.024701 0.143976 -0.080168 0.543525 -0.179049 -0.018304 -0.094630 0.109616 -0.083468 -0.331571 0.178779 -0.006356
polarizability: 3.00065079e+02 -5.57616011e+00 2.11569762e+02 -1.32057790e+01 1.09324560e+00 1.78621338e+02
1716.lowfreq: -9.7788 -7.1151 -0.0009 -0.0007 0.0002 9.9451 30.6268 46.1143 64.8321
frequency: 30.5147 46.0452 64.8015 67.5680 90.8797 97.3084 111.3265 121.5507 152.0474 157.1336 178.4590 191.5016 201.8002 210.0370 226.2811 234.0872 246.7976 259.7720 269.3847 275.6973 281.7647 285.3131 322.3681 337.9523 351.9350 359.5408 374.6055 379.3334 406.7485 413.1407 427.5643 448.7156 462.7440 492.4849 495.8504 519.6521 529.5097 546.0501 571.8640 594.7254 613.8645 622.1531 638.5449 650.1519 676.8985 726.7983 746.5920 776.4080 790.3491 803.2712 818.6953 840.7769 869.7290 883.3345 904.9226 908.8514 915.7813 924.1952 939.1315 945.8755 951.8680 967.1130 972.7828 989.2433 999.6961 1015.8466 1023.6930 1030.8125 1042.4644 1045.7822 1061.7136 1071.7828 1091.3209 1102.9479 1111.6093 1117.9671 1122.2978 1127.7929 1152.0305 1164.7761 1177.8013 1179.9172 1191.6853 1206.8809 1209.7904 1214.5385 1218.5597 1233.0166 1242.3408 1256.6049 1263.6506 1276.3625 1279.5056 1285.5069 1291.1804 1293.3418 1305.4171 1309.1232 1324.2799 1329.3793 1333.8167 1342.3935 1348.2846 1351.3541 1368.7144 1371.8303 1383.1509 1408.0446 1437.4535 1443.3660 1444.8684 1450.3905 1452.7507 1463.6709 1467.8273 1474.8567 1476.9589 1479.4237 1480.5009 1489.9820 1492.4187 1584.9075 1611.6674 1615.4235 1625.3470 2910.2343 2954.4974 2955.3586 2968.1403 2972.6651 2982.3781 2983.2094 2990.4516 2991.1938 2993.5813 2995.4518 2997.9011 3002.8820 3037.7638 3043.1078 3059.6505 3062.8047 3070.4617 3073.9207 3078.6267 3080.1902 3081.0377 3082.8580 3100.4157 3109.7733 3116.1550 3130.1068 3563.9087
redmass: 7.3131 4.4576 4.9724 3.1488 2.9190 3.8092 1.2739 4.0534 3.9979 2.8936 1.9508 3.0982 2.8090 2.0226 2.3204 1.3658 2.1670 2.9048 3.2623 2.7414 2.5042 1.3802 3.5106 3.2524 4.0688 2.8793 2.6601 3.3719 3.8254 3.3133 3.1815 3.3665 2.7215 4.0396 3.8631 3.1402 2.6772 3.8825 3.4947 3.2154 4.0204 3.0215 3.1531 3.4289 3.5853 3.6579 2.8751 2.1785 2.0102 2.2876 2.1122 2.7073 2.4092 1.4835 2.2763 2.0694 2.3108 2.4885 2.2047 1.8084 1.8267 2.5728 1.9900 2.3284 2.3001 1.9945 1.8728 1.8480 1.9973 1.9077 3.2247 2.9770 1.9215 2.0417 1.9780 1.5730 2.7954 1.7767 2.2375 1.7294 1.9429 1.5527 2.0751 1.7859 1.8826 1.8745 1.7346 1.7051 1.7155 1.6732 1.5326 1.7669 1.6794 1.4688 1.5475 1.3849 1.5136 1.5034 1.3839 1.5293 1.4573 1.8761 1.4423 1.3751 1.4343 1.2304 1.2284 1.1875 1.0699 1.0779 1.0666 1.0825 1.0874 1.0680 1.0872 1.0789 1.0751 1.0602 1.0576 1.0768 1.0574 10.0007 8.8457 8.9134 7.7900 1.0793 1.0666 1.0799 1.0641 1.0692 1.0721 1.0687 1.0390 1.0404 1.0576 1.0601 1.0411 1.0660 1.0968 1.0980 1.0984 1.0950 1.1017 1.0983 1.0998 1.0905 1.0940 1.0979 1.0989 1.0989 1.0911 1.1027 1.0663
irintensity: 1.9890 2.6194 2.4235 2.9632 0.0916 3.1789 1.6467 4.1959 0.4197 0.5364 0.3541 0.7470 1.9405 1.6794 1.5248 0.5924 0.5682 4.8301 6.6362 1.0093 51.9284 71.8689 1.7038 0.1140 1.5149 1.9444 2.5280 5.4417 3.8276 1.7210 3.7939 6.4110 0.1275 5.5693 3.3080 3.4267 0.5349 4.9038 11.7831 8.6426 8.1965 4.9682 0.0651 1.2868 14.1704 1.3547 0.8856 7.6230 2.4799 1.5854 0.4699 2.6631 21.2305 30.7516 16.5759 1.2532 12.4931 19.2651 2.4859 12.4135 13.6528 12.8156 1.7722 0.2472 2.2039 0.2104 8.6082 6.8599 2.1329 11.8039 30.0654 4.4110 3.7181 32.5989 2.1891 13.9094 2.0971 6.5251 1.5496 5.9931 32.1193 0.1999 30.1773 75.3506 6.1820 80.9604 22.5929 21.9174 15.3646 32.7329 44.1764 19.2619 22.4804 9.9793 11.1708 2.2753 3.4493 12.7604 7.1303 8.9827 5.7310 4.4481 3.6321 2.1519 3.7901 66.4752 27.0866 28.4619 16.6793 21.9788 20.0394 4.7817 18.4010 14.5071 7.7508 8.3047 6.9413 14.5547 1.3080 7.4885 7.7185 169.1900 133.0877 91.4797 177.5424 9.5578 13.8912 4.0720 20.1296 15.6707 5.0184 38.9144 33.3641 2.4582 5.2371 30.5454 27.6485 24.1728 45.0841 31.4466 18.8283 23.4253 15.0047 35.3786 15.7749 11.8622 12.8622 30.9724 17.9923 6.2090 11.4475 8.3367 5.5860
temp: 298.150 k
press: 1.00000 atm
elementType: 8 8 8 8 6 6 6 6 6 6 6 6 6 6 6 6 6 6 6 6 6 6 6 6 6 1 1 1 1 1 1 1 1 1 1 1 1 1 1 1 1 1 1 1 1 1 1 1 1 1 1 1 1
symmnumber: 1
zpe: 1171573.1 jmol-1
zpe.correction: 0.446229 hartree
zpe.thermalcorrener: 0.470288 hartree
zpe.thermalcorrenthalpy: 0.471232 hartree
zpe.thermalcorrgfe: 0.394780 hartree
zpe.sumelectzpe: -1116.020608 hartree
zpe.sumelectthermal: -1115.996549 hartree
zpe.sumelectthermalent: -1115.995605 hartree
zpe.sumelectthermalfe: -1116.072057 hartree
dipole: -5.4134 3.0604 -0.9220
dipole: 6.2866
quadrupole: -196.0299 -147.0138 -149.2373
quadrupole: 0.7898 25.8671 2.0200
quadrupole: -31.9362 17.0799 14.8564 0.7898 25.8671 2.0200
hfenergy: -1116.4668369 hartree
pointgroup: C01 [X(C21H28O4)]
dipole: -2.1254176 1.2123533 -0.360926 debye
polarizability: 300.1971465|-5.5946766|211.5598071|-12.5486192|1.4785244|178.4992244 unknown
InChI: InChI=1S/C21H28O4/c1-12(22)21(25)9-7-16-15-5-4-13-10-14(23)6-8-19(13,2)18(15)17(24)11-20(16,21)3/h10,15-16,18,25H,4-9,11H2,1-3H3
charge 0 multiplicity 1
53 atoms
O  -3.322292 0.056461 -1.999046
O  0.335485 -2.528732 0.70589
O  -5.456726 -0.204334 0.897964
O  6.315599 -0.132155 -1.138676
C  -1.319744 1.1130 -0.200975
C  -2.18432 -0.139775 0.152546
C  0.096495 1.070071 0.406614
C  0.83526 -0.230255 -0.082346
C  -3.543209 0.269929 -0.54808
C  2.318584 -0.37318 0.433907
C  -2.243088 2.308382 0.136041
C  -1.482823 -1.395517 -0.425849
C  -3.678615 1.788881 -0.208265
C  0.91871 2.313072 -0.000103
C  -0.054524 -1.480136 0.124343
C  -2.399375 -0.320987 1.677727
C  3.064524 0.946593 0.152297
C  2.366111 2.237454 0.538216
C  3.003888 -1.541624 -0.344683
C  2.371427 -0.635334 1.975162
C  -4.759082 -0.569682 -0.086917
C  4.540654 -1.553791 -0.218372
C  4.333663 0.980008 -0.367778
C  5.152911 -0.220393 -0.635893
C  -5.074468 -1.841445 -0.858968
H  -1.201179 1.09359 -1.305881
H  0.025245 1.052895 1.513773
H  0.89588 -0.117028 -1.191653
H  -1.980636 3.210945 -0.442009
H  -2.169498 2.57254 1.207851
H  -1.45886 -1.31143 -1.529615
H  -1.997847 -2.332673 -0.150807
H  -4.375581 1.909246 0.637989
H  -4.115057 2.33247 -1.068035
H  0.429851 3.227909 0.385065
H  0.936076 2.393088 -1.106542
H  -1.434241 -0.452521 2.197179
H  -2.925922 0.533039 2.135165
H  -3.000406 -1.223718 1.885396
H  2.32714 2.30336 1.646608
H  2.956209 3.104995 0.191611
H  2.743869 -1.446623 -1.419458
H  2.588007 -2.499644 0.006931
H  3.41801 -0.65325 2.327326
H  1.847392 0.152267 2.546051
H  1.903118 -1.604643 2.208334
H  -3.981837 0.595237 -2.504417
H  4.989297 -2.358136 -0.827571
H  4.841872 -1.749965 0.831193
H  4.825639 1.941443 -0.567241
H  -5.690116 -1.59738 -1.746712
H  -4.161282 -2.326305 -1.238917
H  -5.655286 -2.524618 -0.218872
