program: Gaussian 09
title: 000102111
version: EM64L-G09RevD.01
frameworkgroup: C1[X(C12H20O3)]
method: RPBEPBE
basis: SDD
operation: Freq
keyword: #pfreq=noraman
keyword: PBEPBE/SDD
title: #p freq=noraman PBEPBE/SDD
converged: YES YES NO NO
title: Mulliken charges:
elementType: O O O C C C C C C C C C C C C H H H H H H H H H H H H H H H H H H H H
charge: -0.234979 -0.246006 -0.277786 -0.379348 -0.376748 -0.366621 -0.389690 -0.376458 -0.310460 -0.481577 0.030132 0.318695 -0.055926 -0.748003 -0.506448 0.198671 0.198566 0.195345 0.195285 0.192580 0.192658 0.217422 0.217437 0.211696 0.211722 0.229656 0.229506 0.225352 0.225418 0.246335 0.246304 0.246504 0.241887 0.237069 0.241813
chargesum: 0.00000
title: Mulliken charges with hydrogens summed into heavy atoms:
elementType: O O O C C C C C C C C C C C C
charge: -0.234979 -0.246006 -0.277786 0.017889 0.013883 0.018617 0.045169 0.046959 0.148702 -0.030807 0.030132 0.318695 -0.055926 -0.008861 0.214320
polarizability: 2.12261676e+02 -1.09587657e+01 1.20275431e+02 -3.70525172e-02 2.39765516e-02 9.73729799e+01
1716.lowfreq: -18.7919 -0.0010 -0.0004 0.0007 3.2146 4.0174 9.1246 13.7855 26.3363
frequency: -18.5733 12.6862 26.3145 31.3290 45.7356 62.7911 69.0515 80.5161 92.6665 120.3063 122.1080 139.6726 150.9300 163.4256 190.2568 203.7316 209.3158 271.0505 303.1524 325.1652 361.0296 386.3475 453.1993 493.1092 532.5824 651.2961 699.8171 724.0962 737.1787 757.2167 765.3337 818.2790 854.3576 899.0421 900.8890 990.1187 990.5191 1011.0037 1031.7192 1033.1085 1042.3747 1056.2232 1069.2301 1079.6361 1105.9675 1108.4552 1117.1736 1151.8648 1154.1666 1169.4144 1196.6814 1210.6457 1216.0042 1251.6469 1261.6491 1278.3740 1281.0703 1295.9397 1298.5687 1301.9990 1334.1783 1352.2923 1360.2522 1379.2131 1401.5766 1427.9589 1452.3825 1458.5881 1463.6332 1463.9934 1464.0449 1464.7138 1465.6305 1469.0435 1475.1727 1483.6507 1490.5067 1626.0982 2285.3021 2952.5393 2956.9097 2959.8628 2965.8886 2972.0867 2986.1616 2990.6653 2994.1482 3000.6526 3002.2328 3004.5274 3004.6318 3029.3314 3048.4723 3055.0073 3059.1301 3059.6984 3078.4750 3106.0731 3151.6708
redmass: 1.0235 4.3894 4.2813 3.3659 2.4579 4.2493 1.2080 2.4399 1.9933 4.5262 2.5698 1.9321 2.4253 6.1583 4.1777 4.0693 2.6703 3.9080 4.0277 4.5868 4.1433 4.4967 3.4106 5.0139 4.4446 7.1050 11.5867 1.0659 1.0968 3.9611 1.1382 1.2251 8.2840 1.2712 8.4482 5.0264 1.2142 4.6437 1.3936 1.3796 4.8418 5.1473 2.9615 2.2042 3.5456 1.3596 1.2539 1.5192 1.3610 3.4507 5.3479 1.4250 1.2526 1.2718 1.3156 1.1484 1.0417 1.1029 1.1059 1.3533 1.4218 1.5184 1.6269 1.5287 1.2241 1.1913 1.0497 1.0821 1.0680 1.0533 1.0419 1.0424 1.0795 1.0762 1.0923 1.0963 1.0987 9.0830 11.6318 1.0590 1.0589 1.0583 1.0592 1.0349 1.0593 1.0976 1.0598 1.0994 1.0563 1.0301 1.1019 1.1044 1.1046 1.1049 1.0985 1.0985 1.1082 1.1049 1.1043
irintensity: 0.0027 0.0076 0.0480 0.0243 0.1895 0.2817 0.0605 3.4230 0.0374 3.6953 4.2588 1.3928 4.9279 1.0063 0.0026 0.9103 13.0885 26.3781 1.1663 14.7795 0.1112 0.5732 7.6498 1.6899 0.3798 4.8459 21.1562 14.0529 0.3781 0.0302 2.5252 0.0614 19.0757 0.0470 74.7324 4.8639 0.2079 3.6885 5.3805 4.0961 1.1592 23.9256 5.7372 1.3020 40.3616 0.0952 0.1428 56.8653 1.3342 0.6463 844.8477 0.0004 33.1900 0.1875 10.8780 1.5296 0.0177 0.1347 0.0540 7.0122 4.3254 3.2450 0.4911 4.9764 0.8125 38.4716 14.3662 1.6053 1.8225 10.6037 12.6331 12.1448 0.3405 0.1014 3.1428 1.6629 28.5611 243.4230 0.1019 4.2927 0.9355 26.1284 66.3153 45.9207 55.1405 3.4602 7.5738 4.0011 52.1297 37.8256 3.5427 21.6691 0.0751 102.0057 23.0034 17.9520 80.1224 29.5867 16.0428
temp: 298.150 k
press: 1.00000 atm
elementType: 8 8 8 6 6 6 6 6 6 6 6 6 6 6 6 1 1 1 1 1 1 1 1 1 1 1 1 1 1 1 1 1 1 1 1
symmnumber: 1
zpe: 777895.2 jmol-1
zpe.correction: 0.296285 hartree
zpe.thermalcorrener: 0.314926 hartree
zpe.thermalcorrenthalpy: 0.315870 hartree
zpe.thermalcorrgfe: 0.245105 hartree
zpe.sumelectzpe: -693.686509 hartree
zpe.sumelectthermal: -693.667867 hartree
zpe.sumelectthermalent: -693.666923 hartree
zpe.sumelectthermalfe: -693.737688 hartree
dipole: 0.4352 -0.1183 0.0047
dipole: 0.4510
quadrupole: -76.0477 -96.4071 -89.6668
quadrupole: 0.3096 -0.0033 -0.0161
quadrupole: 11.3262 -9.0332 -2.2929 0.3096 -0.0033 -0.0161
hfenergy: -693.9827935 hartree
pointgroup: C01 [X(C12H20O3)]
dipole: -0.1710456 0.0470789 0.0025116 debye
polarizability: 212.1867435|-11.2682756|120.3458705|-0.0983349|0.321257|97.3774735 unknown
InChI: InChI=1S/C12H20O3/c1-3-4-5-6-7-8-9-10-11-15-12(13)14-2/h5-11H2,1-2H3
charge 0 multiplicity 1
35 atoms
O  3.992282 0.526825 0.010536
O  6.161699 1.040497 0.023103
O  5.55535 -1.2303 -0.012335
C  -0.990834 0.159448 -0.00105
C  0.34311 -0.620901 -0.007787
C  -2.231745 -0.760768 -0.008849
C  1.576324 0.312753 0.002445
C  -3.562814 0.02214 -0.000884
C  2.883031 -0.477858 -0.005196
C  -4.7992 -0.920383 -0.008751
C  -6.086923 -0.200849 0.000026
C  5.261735 -0.012049 0.00526
C  -7.157105 0.415738 0.00842
C  -8.43566 1.146214 0.020631
C  7.584782 0.6261 0.019561
H  -1.026437 0.831756 -0.883101
H  -1.026337 0.816409 0.892502
H  0.377768 -1.276462 -0.902776
H  0.376544 -1.293737 0.874318
H  -2.195301 -1.433861 0.87348
H  -2.196245 -1.41775 -0.903291
H  1.55111 0.980579 -0.879727
H  1.550387 0.961655 0.89863
H  -3.613436 0.690385 -0.882546
H  -3.612344 0.67398 0.893022
H  2.989261 -1.104462 -0.910155
H  2.985328 -1.127832 0.883613
H  -4.74497 -1.593667 0.871334
H  -4.747179 -1.576011 -0.902188
H  -8.556494 1.72755 0.953544
H  -8.5008 1.853837 -0.826637
H  -9.293119 0.452105 -0.055509
H  7.809007 0.013507 0.909011
H  8.146183 1.570284 0.037727
H  7.813744 0.045433 -0.889879
