program: Gaussian 09
title: 000102090
version: EM64L-G09RevD.01
frameworkgroup: C1[X(C10H23N)]
method: RPBEPBE
basis: SDD
operation: Freq
keyword: #pfreq=noraman
keyword: PBEPBE/SDD
title: #p freq=noraman PBEPBE/SDD
converged: YES YES NO NO
title: Mulliken charges:
elementType: N C C C C C C C C C C H H H H H H H H H H H H H H H H H H H H H H H
charge: -0.570761 -0.392151 -0.381444 -0.375482 -0.379388 -0.021713 -0.371650 -0.359790 -0.716485 -0.715913 -0.394128 0.203661 0.187722 0.192556 0.190211 0.188407 0.187855 0.190282 0.194438 0.191624 0.187717 0.189508 0.218286 0.180333 0.209326 0.203051 0.222831 0.212177 0.211007 0.205610 0.177153 0.206346 0.270896 0.257908
chargesum: 0.00000
title: Mulliken charges with hydrogens summed into heavy atoms:
elementType: N C C C C C C C C C C
charge: -0.041957 -0.000768 0.001323 0.000780 0.005332 0.169912 0.005575 0.038829 -0.081277 -0.087120 -0.010629
polarizability: 1.49680155e+02 -1.51576739e+00 1.04095712e+02 -5.23908620e-01 -1.90588186e+00 9.78389881e+01
1716.lowfreq: -0.0004 -0.0002 0.0006 5.1938 9.7759 16.6588 33.3315 40.2217 50.6941
frequency: 33.1527 39.5931 50.6875 77.3094 87.4817 123.4704 132.0319 136.4807 158.5954 195.9068 207.6134 230.1968 244.2819 252.0456 341.4436 357.2635 411.5433 427.9258 472.9796 503.9268 606.1019 722.2557 734.3605 762.3420 806.1021 822.2362 888.0667 911.7858 936.0964 945.1409 954.2224 981.9254 998.6402 1023.2585 1042.3994 1051.2136 1074.1454 1081.3457 1092.7776 1116.9059 1139.4114 1175.7681 1180.6249 1197.3637 1217.7022 1237.2152 1255.4041 1271.0655 1280.4906 1286.2842 1291.2852 1296.7638 1299.6252 1321.8540 1331.7628 1344.1670 1355.4480 1357.7530 1375.3802 1388.3896 1392.5344 1454.6051 1460.3021 1463.0284 1465.8831 1468.8093 1471.9185 1475.9860 1481.5235 1484.4756 1490.4781 1492.5625 1637.4505 2859.9336 2943.7425 2950.0654 2950.6178 2951.8392 2954.7006 2959.5040 2964.0612 2964.9665 2969.1945 2985.3725 2992.0193 2999.9040 3005.7575 3019.8606 3037.6525 3047.3536 3056.2050 3063.4312 3066.2238 3073.4548 3448.8745 3576.5136
redmass: 3.4561 1.8221 3.7455 2.8891 1.6508 2.5124 2.7895 1.8656 2.0201 3.3818 1.1152 1.5732 1.1294 1.6613 2.7319 2.5422 2.1174 2.8628 2.5419 2.9573 1.2845 1.0670 1.1007 1.1548 1.7609 1.5587 1.2721 1.1781 1.8256 1.8272 1.4816 1.5100 4.4301 1.7427 1.5446 2.9747 2.4389 2.1170 2.4728 1.9462 2.3457 1.7469 1.9922 1.4563 1.4253 1.3496 1.3264 1.2623 1.0284 1.2146 1.0911 1.1670 1.2050 1.3965 1.4135 1.4832 1.6139 1.6294 1.2240 1.4697 1.2166 1.0723 1.0735 1.0686 1.0825 1.0461 1.0594 1.0952 1.0582 1.0951 1.0500 1.0906 1.0942 1.0716 1.0624 1.0594 1.0619 1.0744 1.0630 1.0632 1.0394 1.0566 1.0365 1.0955 1.0972 1.1001 1.0868 1.1031 1.1035 1.1027 1.0993 1.0992 1.0991 1.0987 1.0447 1.0974
irintensity: 0.1616 2.0497 0.0776 0.3947 1.8251 0.0842 0.3664 0.8497 0.1808 2.1546 0.1091 20.2357 5.3818 30.7998 5.0462 0.0575 1.2024 8.1570 2.3576 9.4157 220.7107 12.6079 0.5993 3.8634 0.6279 0.8945 1.3206 3.6555 3.1580 1.9677 0.3063 0.4167 3.9989 0.5034 0.6247 0.1984 2.6111 0.0419 2.9489 26.1219 0.5511 11.3893 1.2459 7.6400 0.9362 4.3655 0.2716 0.6229 1.4027 2.5823 0.9213 0.1588 0.6536 2.6726 2.8853 1.9806 1.0092 0.2452 19.3797 15.7704 15.3967 0.3688 0.0484 0.0770 0.7489 3.0668 5.0300 0.0398 7.8072 9.5870 26.4866 8.4661 39.9696 113.9956 9.0848 0.0351 2.4967 16.2425 5.1143 1.9049 21.4029 216.2747 28.3165 6.0159 3.9297 12.6604 33.7981 1.6133 31.5735 206.8116 9.1207 83.3525 78.3757 56.5141 2.3857 0.1567
temp: 298.150 k
press: 1.00000 atm
elementType: 7 6 6 6 6 6 6 6 6 6 6 1 1 1 1 1 1 1 1 1 1 1 1 1 1 1 1 1 1 1 1 1 1 1
symmnumber: 1
zpe: 823747.4 jmol-1
zpe.correction: 0.313749 hartree
zpe.thermalcorrener: 0.329164 hartree
zpe.thermalcorrenthalpy: 0.330109 hartree
zpe.thermalcorrgfe: 0.270071 hartree
zpe.sumelectzpe: -448.657809 hartree
zpe.sumelectthermal: -448.642394 hartree
zpe.sumelectthermalent: -448.641449 hartree
zpe.sumelectthermalfe: -448.701487 hartree
dipole: -0.3479 -1.0384 -0.7450
dipole: 1.3245
quadrupole: -69.1206 -75.6054 -70.8596
quadrupole: 6.6497 3.8831 -1.0227
quadrupole: 2.7413 -3.7435 1.0022 6.6497 3.8831 -1.0227
hfenergy: -448.9715582 hartree
pointgroup: C01 [X(C10H23N1)]
dipole: 0.1300966 0.4201705 -0.2794548 debye
polarizability: 149.7097009|-1.0639546|103.9245316|-0.0466835|2.1411349|97.9806226 unknown
InChI: InChI=1S/C10H23N/c1-10(2)8-6-4-3-5-7-9-11/h10H,3-9,11H2,1-2H3
charge 0 multiplicity 1
34 atoms
N  6.150779 -0.350215 -0.16824
C  -1.494817 -0.236472 -0.220479
C  -0.19816 0.515167 0.158551
C  -2.776306 0.542057 0.155692
C  1.087176 -0.264814 -0.19891
C  -4.104111 -0.119163 -0.303926
C  2.384838 0.485539 0.177799
C  3.665528 -0.302469 -0.176369
C  -4.334056 -1.496568 0.363877
C  -5.300709 0.821894 -0.025402
C  4.960595 0.448768 0.193012
H  -1.493042 -1.226366 0.278284
H  -1.495619 -0.436304 -1.313035
H  -0.205361 0.729625 1.248017
H  -0.183284 1.501377 -0.351296
H  -2.715948 1.559063 -0.286605
H  -2.810138 0.684301 1.257397
H  1.092747 -0.481688 -1.287889
H  1.07293 -1.249439 0.313233
H  -4.039151 -0.277034 -1.40257
H  2.399864 1.469975 -0.335772
H  2.37732 0.702965 1.266618
H  3.671354 -1.280693 0.342076
H  3.669655 -0.521702 -1.266079
H  -5.29557 -1.936488 0.038917
H  -4.365467 -1.392644 1.466268
H  -3.53432 -2.216365 0.113196
H  -5.174168 1.795905 -0.534552
H  -6.251741 0.376148 -0.372553
H  -5.397314 1.018626 1.060268
H  4.932443 1.461546 -0.28272
H  4.979835 0.613267 1.288154
H  7.037526 0.025469 0.18214
H  6.20319 -0.577167 -1.167105
