program: Gaussian 09
title: 000100105
version: EM64L-G09RevD.01
frameworkgroup: C1[X(C24H21NO4)]
method: RPBEPBE
basis: SDD
operation: Freq
keyword: #p
keyword: freq=noraman
keyword: PBEPBE/SDD
title: #p freq=noraman PBEPBE/SDD
converged: YES YES NO NO
title: Mulliken charges:
elementType: O O O O N C C C C C C C C C C C C C C C C C C C C C C C C H H H H H H H H H H H H H H H H H H H H H
charge: -0.301484 -0.284773 -0.427927 -0.216913 -0.402862 -0.459485 0.326650 0.341619 0.164580 0.165672 -0.257317 -0.438114 -0.447585 -0.398942 -0.398155 -0.248039 -0.242460 -0.244026 -0.237007 -0.160209 -0.609836 0.321279 0.520745 0.168745 -0.394158 -0.392370 -0.220970 -0.220760 -0.246182 0.247735 0.247546 0.224757 0.243849 0.239306 0.239744 0.239227 0.224309 0.225746 0.227287 0.225978 0.306627 0.242143 0.223351 0.346324 0.231819 0.237670 0.223885 0.227594 0.226334 0.389055
chargesum: 0.00000
title: Mulliken charges with hydrogens summed into heavy atoms:
elementType: O O O O N C C C C C C C C C C C C C C C C C C C C C C C C
charge: -0.301484 -0.284773 -0.038871 -0.216913 -0.056538 -0.211750 0.326650 0.341619 0.164580 0.165672 0.214986 -0.194265 -0.208280 -0.159198 -0.158929 -0.023730 -0.016714 -0.016738 -0.011029 0.146419 -0.144342 0.321279 0.520745 0.168745 -0.162339 -0.154700 0.002915 0.006834 -0.019848
polarizability: 2.65861841e+02 -4.08646961e+01 3.17903584e+02 -3.72649897e+01 2.55579002e-01 2.24458734e+02
1716.lowfreq: -5.2816 -3.9439 0.0007 0.0007 0.0009 5.2382 10.1595 22.3882 24.1031
frequency: 9.2129 22.3626 24.0542 25.2069 28.8250 35.4666 53.5532 59.7692 74.3768 83.0488 100.9314 119.9679 137.9847 149.2094 190.7264 194.9196 222.3525 237.8303 243.5618 288.2573 295.4828 325.3882 359.0793 395.5171 404.3694 409.1962 414.5277 445.2369 450.3062 486.4763 508.8078 535.8031 546.9104 556.3924 560.3053 573.3375 573.5845 597.1020 609.9506 617.6232 618.4120 651.7477 691.5751 694.0723 703.9370 708.9018 722.0212 745.4863 749.3964 759.7903 769.7863 786.5983 794.7752 798.3282 817.1111 851.7424 865.3895 866.7492 877.7162 883.2949 918.1461 925.2812 946.8100 951.2098 975.3333 976.0988 984.0571 986.0334 990.2741 994.4440 996.3962 996.7896 1006.3466 1022.0956 1026.4927 1035.1091 1044.1129 1079.1891 1087.7066 1105.0934 1111.2357 1127.9695 1163.8526 1169.7930 1170.8197 1172.6319 1178.2672 1186.3414 1187.1245 1189.9319 1216.5478 1220.9739 1238.7026 1242.5928 1251.8133 1269.3600 1296.1287 1303.3786 1304.7108 1306.7956 1321.5060 1333.7784 1362.1956 1379.5633 1385.3269 1403.4209 1439.5430 1442.6395 1445.0937 1464.9474 1469.5142 1476.6428 1483.8278 1484.9067 1494.3099 1592.5633 1593.9112 1594.9738 1615.0597 1619.8991 1622.4954 1662.5441 1669.0673 2954.7004 2996.6671 2999.7249 3051.7382 3065.1607 3066.6375 3115.7736 3117.8657 3118.6099 3122.6627 3125.7452 3127.8344 3133.3864 3139.2000 3141.0941 3146.9035 3158.3275 3160.8398 3162.9902 3524.0397 3569.1573
redmass: 5.8497 5.0621 5.5840 6.8986 7.9194 4.5882 7.3174 5.6381 5.1436 5.0684 5.7577 6.2098 5.0971 4.9499 5.5410 5.2803 3.6681 3.4783 4.7250 6.4822 3.7358 2.7917 6.2969 2.7112 2.8129 6.3557 3.0914 2.9528 4.5836 3.3973 4.8547 4.9376 3.7079 4.3090 3.9039 3.5284 1.5324 1.4188 2.3363 6.2412 6.8807 5.0347 4.1463 9.7508 1.8695 4.6678 5.0999 1.6205 1.4813 1.8083 4.2101 2.7155 2.5675 4.4284 3.8522 1.2732 2.4064 1.8506 1.4744 2.0216 2.8709 1.7062 1.4362 1.6197 3.3388 1.5564 1.3342 1.3260 5.8438 1.4372 5.8388 2.4593 2.2667 2.2806 2.1863 1.8169 3.5907 2.0653 1.7828 1.8080 1.6538 2.4623 1.2431 1.1374 1.1605 1.0702 1.5673 1.6031 1.6878 1.1600 2.0490 2.0888 1.3618 1.8187 1.3414 2.4572 1.8452 1.5667 1.9252 1.3510 1.4710 1.2887 1.3403 8.2738 7.5688 3.8690 2.2467 2.1779 2.7406 1.1628 2.6822 1.1332 2.7366 3.0257 1.7033 6.6438 6.9819 6.0500 6.1740 7.3776 7.0917 10.3474 9.0791 1.0800 1.0594 1.0597 1.0913 1.1056 1.0966 1.0872 1.0857 1.0866 1.0862 1.0888 1.0890 1.0915 1.0946 1.0942 1.0960 1.1002 1.1002 1.1015 1.0643 1.0773
irintensity: 0.1817 0.1507 0.1248 1.0291 2.1551 0.1949 2.9970 2.3029 0.4466 0.0825 2.1245 0.4191 0.6977 0.0932 7.5755 0.8065 1.1801 3.1788 1.5862 8.8768 1.4789 0.8709 4.6590 3.1222 0.1572 0.1233 7.2456 0.2910 0.9085 2.9800 0.1644 36.1688 14.3316 15.8136 1.6995 0.0781 13.4060 230.5220 40.2135 0.2501 9.2831 2.7710 14.8237 44.6190 28.6151 32.6218 1.0777 0.0838 192.8886 30.4758 4.7444 0.4401 0.1249 6.5055 3.9554 0.0124 4.9240 2.1764 0.0686 15.2962 17.8680 16.9635 0.0396 5.3248 106.2969 15.0435 0.1088 0.3447 0.5275 5.8932 2.5134 25.1091 6.3051 2.2594 6.5359 6.0316 82.9343 186.8058 50.9008 17.8176 0.0910 49.5165 0.4298 9.1945 8.5473 0.6287 116.2610 38.9064 17.9907 7.8127 63.6665 36.2528 1.1302 1.9121 20.0528 1.3938 74.4017 0.3303 1.4872 11.1898 26.1233 4.9046 2.6265 9.4187 0.0814 1.0150 22.6800 8.7000 11.2203 90.9485 10.2260 60.7710 15.7899 8.1068 238.9592 0.6658 0.2286 2.1404 2.5245 3.7579 0.2837 250.6372 220.3679 5.9569 25.0630 39.8468 3.1092 13.7721 11.8008 5.9039 0.4767 7.5872 1.5541 4.5348 3.1915 13.8480 18.2489 40.1417 44.7805 43.4483 29.0850 18.3807 32.1961 42.6277
temp: 298.150 k
press: 1.00000 atm
elementType: 8 8 8 8 7 6 6 6 6 6 6 6 6 6 6 6 6 6 6 6 6 6 6 6 6 6 6 6 6 1 1 1 1 1 1 1 1 1 1 1 1 1 1 1 1 1 1 1 1 1
symmnumber: 1
zpe: 1029007.5 jmol-1
zpe.correction: 0.391928 hartree
zpe.thermalcorrener: 0.417101 hartree
zpe.thermalcorrenthalpy: 0.418045 hartree
zpe.thermalcorrgfe: 0.331667 hartree
zpe.sumelectzpe: -1280.802986 hartree
zpe.sumelectthermal: -1280.777814 hartree
zpe.sumelectthermalent: -1280.776870 hartree
zpe.sumelectthermalfe: -1280.863247 hartree
dipole: 2.0666 0.0660 -2.0449
dipole: 2.9081
quadrupole: -174.5237 -153.4431 -159.0993
quadrupole: -10.3873 2.2833 7.0222
quadrupole: -12.1683 8.9123 3.2561 -10.3873 2.2833 7.0222
hfenergy: -1281.1949145 hartree
pointgroup: C01 [X(C24H21N1O4)]
dipole: -0.8139754 0.0503388 0.8024493 debye
polarizability: 267.711028|41.5409907|316.2057378|-37.5747748|-0.284426|224.3073929 unknown
InChI: InChI=1S/C24H21NO4/c26-23(27)22(14-16-8-2-1-3-9-16)25-24(28)29-15-21-19-12-6-4-10-17(19)18-11-5-7-13-20(18)21/h1-13,21-22,25-26H,14-15H2
charge 0 multiplicity 1
50 atoms
O  -0.327557 -0.84003 -0.907902
O  1.672743 -0.74969 -2.160662
O  2.262365 -3.692465 1.504581
O  4.377961 -3.843868 0.550401
N  1.596181 -1.54933 0.052733
C  -2.380693 0.312791 -1.551811
C  -2.223382 1.441483 -0.529506
C  -3.296011 -0.670823 -0.817494
C  -2.980948 1.15116 0.644243
C  -3.643422 -0.155718 0.466507
C  -1.059679 -0.283952 -2.06558
C  -1.487296 2.633309 -0.629467
C  -3.794201 -1.910541 -1.249864
C  -3.006281 2.06102 1.723688
C  -4.497563 -0.884371 1.323018
C  -1.511821 3.547375 0.454993
C  -4.649032 -2.64482 -0.389041
C  -2.266553 3.262678 1.620219
C  -4.997541 -2.133589 0.885922
C  3.025554 -1.809732 0.176361
C  3.763382 -0.775582 1.112497
C  1.054845 -1.023185 -1.100011
C  3.684319 0.642508 0.575304
C  3.315568 -3.210106 0.711958
C  4.677732 1.131507 -0.31154
C  2.605021 1.493114 0.924363
C  4.595427 2.439159 -0.837788
C  2.517005 2.801021 0.397022
C  3.512913 3.278709 -0.484993
H  -2.900959 0.698309 -2.456057
H  -0.430483 0.47869 -2.55878
H  -1.248084 -1.099641 -2.789108
H  -0.897362 2.861126 -1.525147
H  -3.530619 -2.314247 -2.234676
H  -3.589018 1.847723 2.62697
H  -4.772705 -0.49456 2.309685
H  -0.950157 4.486389 0.388731
H  -5.045073 -3.614345 -0.711228
H  -2.277255 3.982064 2.446871
H  -5.661447 -2.712772 1.537639
H  3.465435 -1.736011 -0.833449
H  4.81628 -1.1030 1.197292
H  3.307462 -0.84099 2.118491
H  0.96883 -1.796642 0.819496
H  5.518794 0.484292 -0.590965
H  1.828406 1.132027 1.60908
H  5.371855 2.80275 -1.520276
H  1.671766 3.440426 0.675437
H  3.448539 4.294035 -0.89256
H  2.500358 -4.586455 1.870701
