program: Gaussian 09
title: 000102083
version: EM64L-G09RevD.01
frameworkgroup: C1[X(C8H13N)]
method: RPBEPBE
basis: SDD
operation: Freq
keyword: #pfreq=noraman
keyword: PBEPBE/SDD
title: #p freq=noraman PBEPBE/SDD
converged: YES YES NO NO
title: Mulliken charges:
elementType: N C C C C C C C C H H H H H H H H H H H H H
charge: -0.090173 0.450983 -0.522270 -0.563497 -0.452135 -0.253648 -0.236403 -0.625177 -0.611805 0.198421 0.213288 0.255661 0.232185 0.250402 0.233284 0.234893 0.245852 0.185387 0.221223 0.223071 0.185927 0.224532
chargesum: 0.00000
title: Mulliken charges with hydrogens summed into heavy atoms:
elementType: N C C C C C C C C
charge: -0.090173 0.450983 -0.110562 -0.075651 -0.201733 -0.020363 -0.001511 0.027285 0.021725
polarizability: 1.14384670e+02 -4.05938377e+00 8.82754685e+01 6.22435350e+00 4.61184841e+00 6.78416307e+01
1716.lowfreq: -19.0838 -5.9470 -0.0005 0.0004 0.0005 2.0360 60.2093 76.6380 105.2591
frequency: 60.0354 76.6021 105.2326 236.3611 238.6781 258.5768 303.2606 338.4050 357.5941 375.4718 457.0464 525.0066 677.5435 699.5814 796.2833 808.7981 863.8963 877.3832 896.0707 936.7348 950.8436 979.0229 1012.8027 1018.7466 1034.4966 1070.9675 1090.9531 1095.4208 1129.6558 1165.2184 1181.0127 1225.1521 1254.5202 1263.5859 1308.1862 1348.9214 1361.6286 1391.6948 1415.9494 1437.9585 1457.6085 1458.0560 1472.5045 1476.5059 1486.8357 1532.2799 1610.2097 2836.5142 2845.1967 2861.1870 2974.1623 2981.5351 3015.5242 3022.9327 3025.1414 3074.6248 3083.4585 3153.0722 3167.0993 3196.1932
redmass: 2.8480 2.9098 3.3000 1.2205 1.1791 1.9299 2.5811 2.6104 1.8380 1.7745 2.5490 2.4288 2.1441 1.6053 4.0999 5.6871 2.0840 2.7914 1.5082 1.3249 1.8004 1.7161 2.0463 1.9080 1.5281 1.1709 1.2530 1.2034 1.3835 1.7466 2.1289 1.4971 2.4240 1.9574 2.3634 1.6822 1.8569 1.1102 1.1396 1.1660 1.0566 1.0668 1.0676 1.0536 1.0529 5.9870 6.2337 1.0679 1.0575 1.0582 1.0848 1.0645 1.0719 1.0722 1.0949 1.1011 1.1009 1.0904 1.0932 1.1076
irintensity: 0.5421 0.9149 1.4211 1.3985 0.2781 0.5863 8.1631 2.3225 4.6671 18.4437 2.2714 0.0525 25.0262 43.5084 12.9108 11.0144 1.9581 7.9203 31.1518 0.0745 16.5553 3.9484 43.3658 13.9471 13.8560 0.3913 6.9724 0.1701 9.4053 9.5673 16.9456 3.1504 5.5977 5.1992 5.8574 15.6905 15.4405 30.6749 3.8752 7.2750 6.9545 11.0081 19.3715 6.6637 10.4864 1.7176 1.7095 50.2345 73.6263 248.1523 23.4078 14.4850 43.2472 41.5867 7.3391 30.0020 39.4786 12.8915 15.7160 19.2845
temp: 298.150 k
press: 1.00000 atm
elementType: 7 6 6 6 6 6 6 6 6 1 1 1 1 1 1 1 1 1 1 1 1 1
symmnumber: 1
zpe: 498579.2 jmol-1
zpe.correction: 0.189899 hartree
zpe.thermalcorrener: 0.199539 hartree
zpe.thermalcorrenthalpy: 0.200483 hartree
zpe.thermalcorrgfe: 0.155111 hartree
zpe.sumelectzpe: -366.641723 hartree
zpe.sumelectthermal: -366.632083 hartree
zpe.sumelectthermalent: -366.631138 hartree
zpe.sumelectthermalfe: -366.676510 hartree
dipole: -0.8935 -0.1939 -0.1864
dipole: 0.9331
quadrupole: -52.9487 -53.7225 -56.2606
quadrupole: 0.7074 1.3609 0.1694
quadrupole: 1.3619 0.5881 -1.9500 0.7074 1.3609 0.1694
hfenergy: -366.8316215 hartree
pointgroup: C01 [X(C8H13N1)]
dipole: 0.351056 0.0846957 -0.0659801 debye
dipolederiv: -0.6807849 -0.0407662 0.0447202 -0.0729882 -0.5420021 -0.0104903 -0.0422853 -0.0035488 -0.4907398 -0.0625228 -0.0496729 -0.0234256 -0.0826529 0.1400529 0.0080658 -0.0868693 -0.0194111 -0.1290176 0.5189737 -0.0263749 0.1382315 0.0486084 0.3820903 -0.1231771 0.2305115 -0.0980311 0.2878957 -0.140946 0.0853925 0.0598621 0.0702016 -0.2343912 0.0733758 0.1089313 0.0741776 0.1300418 -0.1461074 0.1070453 -0.0494218 0.1588047 0.0549215 -0.0890587 -0.0781105 -0.0756597 -0.168109 -0.0746074 -0.1052925 -0.0553587 -0.1776074 0.019997 -0.0240157 -0.0319218 -0.0393414 -0.2534858 0.2038688 -0.0374787 -0.0945465 -0.0322403 -0.1124513 -0.0064233 -0.0910285 -0.0047331 -0.1555557 0.0547602 0.086188 0.0039338 0.1563008 0.3993184 0.0801317 0.0393811 0.0837956 0.3174464 0.464995 0.0534989 -0.1387409 0.0490258 0.3236758 -0.0438192 -0.2226059 -0.0472581 0.1496242 -0.0592437 -0.053981 -0.0086423 0.007415 -0.2407394 0.1671785 -0.0508377 0.0393762 0.0096582 -0.0470668 0.0180636 0.0654462 0.0569043 0.0136075 -0.1158994 0.0367437 -0.0697303 -0.1118325 0.0947326 0.0464586 -0.0659721 0.0545213 0.111128 0.0521203 -0.0768144 0.0726305 0.006595 0.1098291 0.0150762 0.0317386 0.014775 0.0264616 -0.0953055 0.0276645 -0.1290523 0.0121677 0.0906783 -0.0514713 0.038381 -0.0359622 -0.0923239 0.0578055 0.0356435 0.0602365 0.1628085 -0.0236621 -0.0831707 0.06544 -0.0886539 0.0217678 0.0531164 0.0686463 0.0550981 0.1510109 -0.0928854 0.0872614 0.0493837 0.1000942 0.0537866 -0.0003074 0.0611353 0.0033226 0.1719824 -0.087029 0.0130497 0.1318836 0.001867 0.0571144 -0.0247389 0.1255428 -0.0119204 0.0639069 0.0226578 -0.1103267 -0.0290629 -0.1260165 -0.2645132 -0.1097043 0.0316673 0.0633816 -0.0139573 -0.0180627 0.0478474 -0.1585362 0.081576 0.0209497 0.0813806 -0.1169331 0.0468536 -0.0433682 -0.0801642 0.0618003 -0.0650314 0.0664937 0.0464839 0.0790544 -0.1484116 0.0999394 -0.0203856 -0.1324727 -0.0349467 0.0756293 -0.2410171 -0.1913302 0.1111492 0.10927 0.0398175 0.0276299 0.0850594 -0.0282003 -0.0159115 -0.0094493 0.0063959 -0.1204383 0.070681 -0.139943 -0.1043159 unknown
polarizability: 114.5944295|-3.3522302|88.6044473|-5.9398903|-3.6420014|67.3028919 unknown
InChI: InChI=1S/C8H13N/c1-9(2)7-8-5-3-4-6-8/h3-5H,6-7H2,1-2H3
charge 0 multiplicity 1
22 atoms
N  1.919418 -0.207276 0.154385
C  -0.479824 0.165095 -0.413187
C  0.955041 0.335476 -0.843935
C  -1.076604 -1.171501 -0.00308
C  -1.46587 1.122831 -0.337872
C  -2.522482 -0.843368 0.315945
C  -2.729141 0.500713 0.109373
C  1.90369 0.548976 1.423034
C  3.281659 -0.330456 -0.400216
H  1.149678 1.417395 -1.065994
H  1.133077 -0.21958 -1.788524
H  -0.530501 -1.606485 0.85814
H  -0.99094 -1.920086 -0.818142
H  -1.342659 2.185304 -0.569022
H  -3.257564 -1.576627 0.656601
H  -3.669169 1.040201 0.253981
H  0.875572 0.586315 1.822557
H  2.264307 1.603809 1.308862
H  2.548245 0.043505 2.164506
H  3.942477 -0.809976 0.344228
H  3.740472 0.652455 -0.681877
H  3.261916 -0.968919 -1.301965
