program: Gaussian 09
title: 000102167
version: EM64L-G09RevD.01
frameworkgroup: C1[X(C23H34O2)]
method: RPBEPBE
basis: SDD
operation: Freq
keyword: #pfreq=noraman
keyword: PBEPBE/SDD
title: #p freq=noraman PBEPBE/SDD
converged: YES YES NO NO
title: Mulliken charges:
elementType: O O C C C C C C C C C C C C C C C C C C C C C C C H H H H H H H H H H H H H H H H H H H H H H H H H H H H H H H H H H
charge: -0.214593 -0.235069 -0.105057 0.389809 -0.164865 -0.099481 -0.244181 0.223615 -0.538211 -0.616459 -0.536794 -0.067544 -0.516427 -0.191197 0.445064 -0.828204 -0.494653 -0.812164 0.149508 -0.775624 -0.561382 -0.557800 -0.767072 0.163341 -0.805505 0.220015 0.234707 0.206483 0.220776 0.201245 0.206908 0.240010 0.211738 0.223145 0.225061 0.272886 0.223116 0.216023 0.224966 0.250110 0.227298 0.222919 0.218081 0.215455 0.234269 0.220440 0.227528 0.207613 0.222651 0.222576 0.244696 0.231040 0.272161 0.228901 0.221128 0.220750 0.242325 0.249927 0.253998
chargesum: 0.00000
title: Mulliken charges with hydrogens summed into heavy atoms:
elementType: O O C C C C C C C C C C C C C C C C C C C C C C C
charge: -0.214593 -0.235069 0.114958 0.389809 0.069842 0.107001 -0.023405 0.223615 -0.130058 -0.164710 -0.088587 0.205342 -0.077289 0.033769 0.445064 -0.127877 -0.061116 -0.129928 0.149508 -0.122785 -0.085646 -0.285639 -0.096293 0.163341 -0.059255
polarizability: 3.14650176e+02 -3.48836067e+00 2.32904908e+02 -1.45394771e+01 3.25512680e+00 1.92382676e+02
1716.lowfreq: -15.8737 -10.2957 -0.0005 -0.0001 0.0005 2.2355 27.8285 31.9344 56.1582
frequency: 27.6906 31.5606 56.1099 62.0281 62.8395 92.7953 106.1818 132.5107 142.5620 144.8879 147.9306 171.0934 193.7146 197.8315 208.1973 221.1297 230.7256 238.2330 246.8288 258.9893 269.4987 276.0206 285.4704 309.4462 321.6120 331.7773 363.8849 368.9933 387.9705 393.9930 409.8194 414.8352 446.5638 461.6105 483.2768 506.0085 507.4851 524.5598 537.8257 544.5389 582.0861 585.3293 618.9462 643.7401 646.2846 682.0279 732.5651 755.4054 779.1105 810.6981 824.2972 841.8968 844.3191 871.5336 883.4113 900.0945 905.5469 915.2362 922.5210 928.2884 936.6448 945.6086 954.0012 961.0145 967.4510 987.2683 999.8152 1008.8458 1018.6744 1024.4828 1031.4268 1048.6219 1061.5163 1069.9015 1081.3859 1087.2107 1101.0976 1109.7889 1116.8082 1122.2628 1124.1316 1133.4983 1143.7796 1158.4536 1162.8837 1177.9818 1185.3698 1187.1738 1196.7948 1204.7900 1221.0918 1231.8978 1236.4395 1243.2875 1260.0281 1270.6678 1275.7171 1283.1472 1285.8790 1292.6291 1296.0901 1301.3412 1319.1923 1323.8034 1326.1411 1328.6547 1331.6582 1337.8742 1343.6546 1351.2973 1353.9644 1357.1576 1364.9560 1367.6491 1384.7821 1391.9177 1392.1745 1400.3290 1441.7585 1443.6444 1450.9114 1460.0830 1463.2728 1466.8120 1469.9817 1471.5450 1473.8058 1476.7388 1480.0123 1480.8495 1483.6742 1484.2133 1486.2270 1493.2917 1582.8882 1616.7581 1619.9651 2907.8450 2914.0093 2922.6643 2952.3784 2956.4844 2960.6227 2964.4514 2968.5624 2973.9668 2976.9730 2978.9404 2981.5286 2983.7137 2986.6015 2992.6858 2995.6961 3010.3791 3016.1132 3029.7499 3041.8054 3046.0529 3050.8503 3060.3010 3061.3709 3062.6201 3066.8716 3072.7080 3075.4053 3078.6705 3079.0256 3079.3288 3097.5356 3118.2991 3143.2435
redmass: 4.0253 4.9672 3.2005 3.6557 3.8004 3.2834 1.1239 2.5286 3.7491 2.0988 2.8216 1.5195 2.4051 2.1922 1.8644 2.1449 1.8574 1.6642 2.5868 1.5727 1.9242 2.2509 1.9062 2.8944 2.7764 2.6685 3.0539 3.2723 2.5917 3.0625 2.9200 3.1156 2.9469 2.7145 3.1800 2.7082 3.3004 2.5352 2.8740 3.1003 3.8003 3.1563 3.7543 3.4017 2.4545 3.2891 3.0673 2.8120 2.1520 2.4705 2.2715 2.3650 2.3921 2.4196 1.5835 1.7319 1.8343 1.8155 1.7420 1.8056 2.0294 1.8879 1.7095 1.9030 1.7699 2.1564 2.0781 1.7975 1.8921 1.9306 1.8630 1.7834 2.2968 2.1494 2.0098 2.3982 1.8960 1.8046 2.2828 1.8666 2.5501 2.1899 1.9184 1.8328 1.9161 2.0913 1.7691 1.8617 2.4486 1.7741 1.5848 1.5388 1.5627 1.3888 1.4446 1.5180 1.6326 1.6307 1.5020 1.3663 1.5554 1.4221 1.4561 1.3869 1.3736 1.3672 1.4052 1.4459 1.5440 1.3954 1.6421 1.7859 1.2526 1.4759 1.2100 1.1996 1.2102 1.1980 1.0744 1.0791 1.0589 1.0718 1.0862 1.0824 1.0744 1.0646 1.0637 1.0446 1.0524 1.0549 1.0558 1.0485 1.0777 1.0649 10.3046 7.4840 7.3153 1.0815 1.0800 1.0793 1.0620 1.0678 1.0762 1.0397 1.0763 1.0641 1.0384 1.0363 1.0598 1.0399 1.0622 1.0543 1.0482 1.0842 1.0944 1.0997 1.0990 1.1021 1.1005 1.0989 1.0943 1.0961 1.0990 1.0994 1.0991 1.0993 1.0970 1.0993 1.0981 1.1007 1.0901
irintensity: 2.6172 2.9564 0.4011 0.2593 4.9260 1.4709 0.4118 0.6227 0.1256 2.4921 0.4687 1.1630 0.0996 0.7354 0.9755 0.1135 2.0181 0.0931 0.5796 1.9571 1.4164 0.1762 0.8808 0.5780 1.9300 0.3639 0.2110 0.1687 0.5151 2.5422 0.8810 3.5778 0.7000 2.6114 1.1321 0.4024 3.1578 0.2554 3.4540 0.2527 10.1816 4.0401 3.0100 0.2665 1.1395 11.0326 2.5377 1.2209 4.0074 0.6773 2.2872 6.2056 2.8865 1.3040 8.5701 1.3764 7.3849 14.2582 1.7171 3.6921 0.1168 3.6302 7.4843 13.8378 2.8075 2.3641 0.2257 8.0266 1.6777 2.5526 5.1583 0.2688 2.0436 0.4078 0.8395 1.7692 5.9045 2.3421 2.3341 5.7665 12.4760 2.4076 2.8523 53.2348 2.0031 21.7608 3.9686 28.7423 3.3379 14.6600 7.7650 10.6112 33.9745 21.1994 16.6867 1.7680 25.8067 20.7243 23.7985 1.5526 17.3141 4.6053 2.9302 9.9855 2.4607 2.2992 3.5363 0.8821 18.1430 2.5088 7.8511 3.1300 63.0405 16.8091 13.0485 12.7507 20.1031 33.5966 15.7698 19.4030 11.2451 5.8375 2.4269 6.4847 16.5403 0.7961 3.5366 13.0665 12.8134 6.3575 7.9008 12.9919 3.7035 8.5326 135.9787 257.9361 82.3621 1.6393 19.6074 10.4204 31.5297 13.3422 18.6441 34.7388 43.3059 29.8342 7.5818 29.3748 19.2475 28.1000 25.5220 8.3207 21.5147 11.5782 45.2391 33.4481 44.7620 30.5072 30.3211 52.6410 11.3699 23.8905 34.6744 28.9656 42.9437 31.1692 30.1100 31.8458 26.1459 17.0790 6.4186
temp: 298.150 k
press: 1.00000 atm
elementType: 8 8 6 6 6 6 6 6 6 6 6 6 6 6 6 6 6 6 6 6 6 6 6 6 6 1 1 1 1 1 1 1 1 1 1 1 1 1 1 1 1 1 1 1 1 1 1 1 1 1 1 1 1 1 1 1 1 1 1
symmnumber: 1
zpe: 1357333.0 jmol-1
zpe.correction: 0.516981 hartree
zpe.thermalcorrener: 0.542228 hartree
zpe.thermalcorrenthalpy: 0.543173 hartree
zpe.thermalcorrgfe: 0.463538 hartree
zpe.sumelectzpe: -1045.364581 hartree
zpe.sumelectthermal: -1045.339334 hartree
zpe.sumelectthermalent: -1045.338389 hartree
zpe.sumelectthermalfe: -1045.418024 hartree
dipole: -2.6306 -0.2562 0.2117
dipole: 2.6515
quadrupole: -212.5154 -144.1407 -154.3492
quadrupole: 3.0884 25.8233 1.7584
quadrupole: -42.1803 26.1944 15.9859 3.0884 25.8233 1.7584
hfenergy: -1045.881562 hartree
pointgroup: C01 [X(C23H34O2)]
dipole: -1.0352265 -0.1051609 0.0741366 debye
polarizability: 314.9529976|-3.2377811|232.9238281|-13.3381094|2.8076455|192.0609355 unknown
InChI: InChI=1S/C23H34O2/c1-13-10-17-18(22(4)8-6-16(25)12-19(13)22)7-9-23(5)20(17)11-14(2)21(23)15(3)24/h12-14,17-18,20-21H,6-11H2,1-5H3
charge 0 multiplicity 1
59 atoms
O  -5.559075 -0.625205 0.799973
O  6.180518 -0.479401 -1.26014
C  -1.394219 0.756664 -0.164324
C  -2.261359 -0.49918 0.176082
C  0.025536 0.708535 0.440604
C  0.752644 -0.570182 -0.078214
C  -3.600807 -0.076479 -0.556845
C  2.241276 -0.703216 0.446868
C  -1.540852 -1.741049 -0.401147
C  -2.32182 1.951845 0.158513
C  -0.09298 -1.85631 0.149427
C  -3.759831 1.449692 -0.22844
C  0.840335 1.96391 0.068731
C  2.295511 1.907757 0.613229
C  2.990719 0.620345 0.168247
C  -2.512744 -0.670505 1.69829
C  2.921966 -1.879029 -0.324058
C  2.293201 -0.984729 1.983035
C  -4.82021 -0.919412 -0.180912
C  -4.384782 2.233003 -1.40235
C  4.460168 -1.889168 -0.230677
C  4.238371 0.641874 -0.405563
C  3.053223 3.210853 0.287101
C  5.043878 -0.560343 -0.699662
C  -5.111533 -2.140391 -1.046187
H  -1.259894 0.740699 -1.271758
H  -0.057258 0.667612 1.547463
H  0.839404 -0.435419 -1.182408
H  -3.41766 -0.205399 -1.645172
H  -1.504447 -1.660292 -1.508526
H  -2.090095 -2.673017 -0.15924
H  -2.267926 2.20985 1.233787
H  -2.047464 2.860511 -0.407972
H  -0.13621 -2.095315 1.228776
H  0.396912 -2.717114 -0.341731
H  -4.436906 1.532131 0.642471
H  0.346674 2.869542 0.470408
H  0.869378 2.073893 -1.036155
H  2.208154 1.843358 1.72221
H  -3.112627 0.156171 2.113985
H  -3.07267 -1.602475 1.896624
H  -1.568073 -0.723818 2.265488
H  2.636582 -1.808184 -1.393713
H  2.527856 -2.841581 0.05058
H  3.337272 -0.989727 2.343997
H  1.746568 -0.222718 2.565649
H  1.852537 -1.969878 2.218493
H  -3.73482 2.196069 -2.298475
H  -5.373311 1.820992 -1.680446
H  -4.530766 3.296172 -1.136005
H  4.899415 -2.704922 -0.831571
H  4.787164 -2.053946 0.816379
H  4.738999 1.589982 -0.630269
H  4.05536 3.236816 0.750903
H  3.175478 3.343315 -0.804027
H  2.484341 4.078143 0.668875
H  -5.491861 -1.807489 -2.032451
H  -4.191582 -2.72118 -1.240321
H  -5.871662 -2.779162 -0.569633
