program: Gaussian 09
title: 000100097
version: EM64L-G09RevD.01
frameworkgroup: C1[X(C10H15N5O4)]
method: RPBEPBE
basis: SDD
operation: Freq
keyword: #p
keyword: freq=noraman
keyword: PBEPBE/SDD
title: #p freq=noraman PBEPBE/SDD
converged: YES YES NO NO
title: Mulliken charges:
elementType: O O O O N N N N N C C C C C C C C C C H H H H H H H H H H H H H H H
charge: -0.436601 -0.206819 -0.250121 -0.332211 -0.374983 -0.438756 -0.329430 -0.080345 -0.534917 -0.146960 -0.541410 0.443937 0.163853 0.266440 -0.520308 -0.478451 -0.249324 0.296290 -0.503793 0.315579 0.250490 0.224238 0.323866 0.243428 0.251462 0.378347 0.258078 0.322027 0.242210 0.390120 0.223477 0.250646 0.287407 0.292534
chargesum: 0.00000
title: Mulliken charges with hydrogens summed into heavy atoms:
elementType: O O O O N N N N N C C C C C C C C C C
charge: -0.046481 -0.206819 -0.250121 -0.332211 -0.051117 -0.060409 -0.007403 -0.080345 0.045024 0.168620 -0.066682 0.443937 0.163853 0.266440 -0.025419 -0.220373 -0.007113 0.296290 -0.029670
polarizability: 1.84122128e+02 -6.62650427e+00 1.63460323e+02 -3.27976212e+00 7.40698338e+00 1.10751157e+02
1716.lowfreq: -5.2008 -0.0011 -0.0010 -0.0009 3.0306 6.0738 24.6356 27.0298 29.3970
frequency: 23.9031 26.8954 29.3605 36.6307 50.7446 60.9513 76.7656 94.5729 104.3530 134.1485 145.3826 166.7654 203.9026 242.2013 260.4030 268.2926 285.8999 303.7507 322.1533 345.8529 403.9050 447.1988 507.4468 537.3940 553.2790 572.3981 579.4989 584.2605 602.7564 623.0217 636.9079 656.3146 684.7841 704.9221 745.2170 752.2703 780.4855 816.3630 843.8435 856.7927 865.7112 884.1145 894.2020 916.3358 917.8110 987.5366 1003.5766 1004.2039 1049.5403 1077.4911 1098.9979 1105.8478 1129.2493 1134.1860 1156.6217 1190.8489 1218.2672 1234.4755 1246.5983 1252.5051 1257.2811 1268.7057 1297.0527 1314.4387 1325.9317 1327.4510 1349.6590 1356.9035 1358.2633 1380.0087 1432.6301 1434.2502 1437.6537 1458.2595 1492.8867 1499.7191 1555.2985 1603.5559 1636.8909 1655.3517 1672.2658 2971.3722 2982.6021 3012.1390 3042.1933 3057.3719 3071.6964 3084.0333 3217.7482 3237.0438 3363.7583 3465.1012 3522.2972 3547.9677 3565.6312 3589.1687
redmass: 6.0273 8.6892 8.7042 4.4909 3.2776 4.0615 4.8738 6.7573 4.4869 6.6865 5.6704 5.4215 2.3387 3.3154 2.1830 3.3972 3.6057 2.6212 3.4514 3.4145 3.4648 3.0886 3.2930 1.8269 2.4233 1.7789 2.2322 3.0528 1.6636 1.5375 2.2262 3.3783 3.4545 4.0984 5.4540 5.2391 1.4367 1.4809 2.8436 3.4389 3.2953 1.5548 4.9116 2.0463 1.8303 3.4016 2.7990 2.9911 4.3983 2.3579 2.7701 2.8098 1.8134 1.9929 1.8332 1.4140 1.6782 1.4191 2.4807 1.8694 1.4726 1.3734 1.7007 1.4810 1.2555 1.4808 1.3096 1.4112 2.9327 2.4067 1.1417 1.0953 2.3315 1.2268 1.9064 1.7662 3.9937 6.1359 6.8837 1.0854 9.2274 1.0659 1.0606 1.0607 1.1014 1.0928 1.0875 1.1025 1.0978 1.0989 1.0886 1.0453 1.0643 1.0774 1.0784 1.0977
irintensity: 0.5541 0.5374 7.0980 0.9501 5.3275 0.6296 3.5514 1.1137 4.1243 17.6268 3.9431 2.6329 17.2927 12.6731 48.2106 31.9944 12.2688 15.6101 27.0089 2.5764 8.3931 8.5739 9.1383 61.5781 26.9757 61.0331 29.9903 27.7554 171.0155 287.1261 66.8491 29.8266 16.8716 79.5376 12.4564 13.9236 44.7672 14.0059 13.2435 23.3753 23.0280 9.7643 30.6675 50.7913 68.5738 11.4185 2.9102 18.6777 4.2806 240.9525 11.1666 15.7748 33.6086 0.7006 4.0301 1.4365 74.7182 7.0106 3.0379 14.3436 12.7184 20.0786 40.1719 2.1699 2.4307 10.9342 7.3980 22.0758 12.6504 19.8781 11.9134 17.7571 43.5599 27.3413 152.5001 163.8946 26.6663 206.5058 162.4204 43.9643 256.9291 30.2806 29.6780 24.1690 18.7427 5.7160 8.7703 7.6078 6.6099 7.6097 559.2128 2.9612 34.3734 29.9150 32.5238 5.3376
temp: 298.150 k
press: 1.00000 atm
elementType: 8 8 8 8 7 7 7 7 7 6 6 6 6 6 6 6 6 6 6 1 1 1 1 1 1 1 1 1 1 1 1 1 1 1
symmnumber: 1
zpe: 695536.9 jmol-1
zpe.correction: 0.264916 hartree
zpe.thermalcorrener: 0.284461 hartree
zpe.thermalcorrenthalpy: 0.285405 hartree
zpe.thermalcorrgfe: 0.213483 hartree
zpe.sumelectzpe: -963.304651 hartree
zpe.sumelectthermal: -963.285107 hartree
zpe.sumelectthermalent: -963.284162 hartree
zpe.sumelectthermalfe: -963.356084 hartree
dipole: -0.6283 -8.0080 -3.8582
dipole: 8.9112
quadrupole: -107.2995 -116.1604 -117.1247
quadrupole: 5.9036 -11.1760 -0.1792
quadrupole: 6.2287 -2.6322 -3.5965 5.9036 -11.1760 -0.1792
hfenergy: -963.5695674 hartree
pointgroup: C01 [X(C10H15N5O4)]
dipole: 0.3992636 -2.9609349 1.8343808 debye
polarizability: 183.2437054|8.2119803|162.4997866|-0.7514545|-12.4125451|112.5901159 unknown
InChI: InChI=1S/C10H15N5O4/c11-2-8(16)13-4-9(17)15-7(10(18)19)1-6-3-12-5-14-6/h3,5,7,13-15,18H,1-2,4,11H2
charge 0 multiplicity 1
34 atoms
O  -3.49121 -1.962943 1.118677
O  -4.491227 -1.010652 -0.754326
O  0.169713 -1.522745 -1.637961
O  2.114122 -0.118751 1.191976
N  -1.030776 -1.243943 0.34874
N  0.209624 1.785664 0.329053
N  2.421825 -2.150633 0.134795
N  0.021867 3.748512 -0.792679
N  4.605342 0.868081 0.038837
C  -2.132158 -0.471976 -0.230891
C  -2.239549 0.967611 0.397338
C  -1.148913 1.919979 0.002718
C  -3.48119 -1.16687 -0.041509
C  0.026377 -1.727508 -0.398484
C  1.043012 -2.572522 0.408223
C  -1.23664 3.140449 -0.68372
C  0.868748 2.898138 -0.173624
C  2.86843 -0.914051 0.539345
C  4.336035 -0.558867 0.195266
H  -1.939763 -0.382742 -1.313711
H  -3.198226 1.406463 0.067512
H  -2.300229 0.84924 1.498791
H  -1.095322 -1.476109 1.342061
H  0.849598 -2.497201 1.493582
H  0.934203 -3.62786 0.103425
H  0.688394 0.992739 0.785026
H  -2.127167 3.609825 -1.098172
H  2.986166 -2.703828 -0.51101
H  1.939673 3.048218 -0.062363
H  -4.397066 -2.355116 1.24466
H  4.643088 -1.091695 -0.7250
H  4.970096 -0.955723 1.012679
H  4.181024 1.287843 -0.794265
H  4.408698 1.416475 0.88161
