program: Gaussian 09
title: 000102180
version: EM64L-G09RevD.01
frameworkgroup: C1[X(C22H29FO3)]
method: RPBEPBE
basis: SDD
operation: Freq
keyword: #p
keyword: freq=noraman
keyword: PBEPBE/SDD
title: #p freq=noraman PBEPBE/SDD
converged: YES YES NO NO
title: Mulliken charges:
elementType: F O O O C C C C C C C C C C C C C C C C C C C C C C H H H H H H H H H H H H H H H H H H H H H H H H H H H H H
charge: -0.220520 -0.445905 -0.214193 -0.250692 -0.101710 0.361216 -0.243482 0.316633 -0.228843 -0.624559 -0.266853 -0.543462 0.014761 -0.464197 -0.481433 -0.221502 -0.868238 0.542650 -0.784283 0.165767 -0.186567 -0.761185 -0.614064 -0.395616 -0.799872 0.172648 0.257598 0.234927 0.242067 0.237824 0.242123 0.271955 0.218826 0.231610 0.219714 0.234962 0.262818 0.217340 0.224054 0.282607 0.224585 0.211319 0.213748 0.278058 0.243485 0.273497 0.365281 0.225981 0.219842 0.229908 0.275430 0.253152 0.246125 0.247367 0.257293
chargesum: 0.00000
title: Mulliken charges with hydrogens summed into heavy atoms:
elementType: F O O O C C C C C C C C C C C C C C C C C C C C C C
charge: -0.220520 -0.080623 -0.214193 -0.250692 0.155888 0.361216 -0.008555 0.316633 0.013224 -0.144612 0.005102 -0.093026 0.014761 -0.009522 -0.001274 0.002552 -0.149727 0.542650 -0.048992 0.165767 0.086931 -0.085453 -0.338634 -0.142464 -0.049086 0.172648
polarizability: 3.04682195e+02 -5.56371451e+00 2.22234972e+02 -2.41123893e+01 6.33848121e+00 1.88803557e+02
1716.lowfreq: -9.5229 -4.3680 -0.0006 -0.0002 0.0003 14.0861 29.9329 41.7417 56.2205
frequency: 29.7479 41.6980 56.1964 65.7570 85.8626 106.1220 114.8810 117.9533 138.3568 144.0610 166.0207 176.8179 182.6739 202.2405 213.8113 222.7072 237.5710 240.0894 253.1205 261.6597 271.6393 282.1202 290.8772 296.0654 300.4955 319.2955 328.5767 357.2442 364.0397 391.6814 396.0190 429.2927 431.2857 456.1744 484.3987 490.8660 499.0733 511.0785 531.9135 546.7903 577.0078 581.5887 605.6524 633.2601 655.1814 661.5988 679.9512 694.1309 700.3309 758.2809 797.5620 821.5541 836.8985 839.2047 856.1118 862.3169 868.5487 902.8825 915.6147 918.2594 922.7913 927.1701 944.8163 952.4823 957.6248 971.8566 992.4686 999.4094 1003.7320 1005.7295 1018.3550 1026.1942 1038.9515 1044.6106 1056.3721 1068.0808 1081.4764 1097.7185 1103.5880 1119.9102 1123.8366 1131.3141 1146.9126 1158.9862 1164.5486 1173.1979 1179.6970 1189.9409 1206.1431 1218.9332 1225.0540 1238.5716 1245.5864 1258.0461 1272.1836 1278.6708 1286.3327 1290.9401 1293.2055 1299.8794 1306.8468 1321.5246 1327.9522 1334.0221 1343.7031 1354.8888 1362.0710 1368.6928 1370.4671 1375.5848 1376.9044 1387.6463 1394.1641 1403.2617 1441.9922 1449.7766 1455.3292 1460.7286 1466.0929 1471.4568 1479.6653 1482.1031 1486.1601 1492.7262 1496.9155 1500.8658 1556.1048 1617.2627 1621.9879 1666.1725 2941.8835 2954.3017 2971.2797 2977.2719 2981.2899 2981.9594 2983.2094 2988.0789 2988.9264 2993.8595 2996.9693 3016.6607 3041.8702 3049.1057 3050.9276 3052.3360 3057.0054 3059.5227 3076.8785 3081.3857 3081.7410 3087.8411 3088.7573 3111.7457 3120.1550 3121.5688 3150.5071 3154.8818 3585.3455
redmass: 7.4047 3.8350 5.3728 4.2951 3.3374 2.1227 1.1808 2.1782 1.8594 4.3651 3.8165 2.5857 3.8703 3.5593 4.7744 2.7739 2.8435 2.5471 2.2653 2.2150 2.4052 1.2011 1.7714 2.9876 1.9662 2.6840 4.0051 3.4821 2.6728 3.3014 4.6332 4.0208 3.9671 3.0656 3.1598 3.2209 3.7464 3.5895 3.5627 3.7648 3.1437 3.7513 3.5339 4.1801 2.9973 3.8004 3.5951 3.0876 2.5213 3.4831 2.9205 1.6909 1.8857 2.2252 2.4929 3.2825 2.3546 1.9438 2.6423 1.8065 2.2498 2.0035 1.8646 2.0264 2.1203 1.9048 2.1379 2.2986 1.3901 2.1103 2.1957 1.9208 2.6875 2.7723 2.2115 2.1696 2.0887 2.9274 1.7303 2.1972 2.1293 2.3864 1.5970 2.8675 2.1104 1.7803 2.2801 1.8052 1.7721 1.2078 1.5782 1.5032 1.3593 1.4485 1.3412 1.4258 1.6090 1.4605 1.8477 1.6471 1.4676 1.6034 1.3821 1.5507 1.4728 1.4245 1.5314 1.3601 1.2858 1.3320 1.6871 1.4272 1.2145 1.1986 1.0767 1.0702 1.0725 1.0855 1.0613 1.0724 1.0731 1.0466 1.0551 1.0673 1.0523 1.0588 8.5381 8.6015 7.1389 7.3262 1.0802 1.0808 1.0424 1.0397 1.0738 1.0399 1.0630 1.0731 1.0639 1.0638 1.0368 1.0627 1.0987 1.0894 1.1009 1.0997 1.0995 1.0948 1.0994 1.1028 1.1000 1.0949 1.0993 1.0872 1.0995 1.1003 1.0968 1.0922 1.0660
irintensity: 2.4758 2.3242 0.9330 2.8256 3.0077 43.9977 0.1144 25.1262 15.8996 5.9504 0.2714 6.9380 4.1827 2.5896 4.6863 0.4258 6.1546 1.3889 0.5144 4.7373 4.4045 0.1076 2.8383 4.2057 5.6255 0.4129 3.4424 0.6175 0.8891 1.1682 6.2539 0.5470 1.0601 1.3107 7.8068 2.6598 0.3436 10.0310 2.2180 7.4200 1.1927 9.0075 13.7041 1.2410 0.9598 0.0435 3.3133 11.5147 4.0679 5.1089 1.5555 15.6106 12.3621 2.4656 16.1485 4.0639 19.4257 5.1979 13.6331 16.5657 6.2854 4.7371 14.8786 20.9062 25.4375 9.3932 1.5921 14.4631 0.7188 19.5820 7.4390 5.7362 4.7318 9.1760 14.2305 21.0574 3.8497 12.2462 9.2251 12.2968 17.2103 10.7432 16.0527 3.9332 35.3521 14.6855 20.9107 4.0609 26.4903 12.1975 14.2430 3.4376 33.5393 15.2866 6.1404 0.6862 27.5712 6.8501 19.3115 6.5346 12.7684 1.0355 9.0594 32.7169 3.3091 1.4579 9.5140 35.0172 61.8424 6.9269 9.3714 14.9139 17.4349 37.0311 16.7396 10.8791 12.4242 4.0196 9.3725 9.2612 4.2393 13.1518 14.5288 18.7237 6.7686 7.1863 186.2009 23.2929 104.4935 130.4352 13.5726 2.2795 19.9214 1.5481 10.6512 22.5810 16.9790 30.1734 29.8517 37.2323 33.7579 29.0685 9.9288 8.6306 36.4430 38.1175 15.1217 7.8439 31.4566 19.7040 42.3789 12.4669 32.2714 3.1180 4.3166 16.0103 18.0227 1.9162 23.4209
temp: 298.150 k
press: 1.00000 atm
elementType: 9 8 8 8 6 6 6 6 6 6 6 6 6 6 6 6 6 6 6 6 6 6 6 6 6 6 1 1 1 1 1 1 1 1 1 1 1 1 1 1 1 1 1 1 1 1 1 1 1 1 1 1 1 1 1
symmnumber: 1
zpe: 1213239.9 jmol-1
zpe.correction: 0.462099 hartree
zpe.thermalcorrener: 0.487489 hartree
zpe.thermalcorrenthalpy: 0.488433 hartree
zpe.thermalcorrgfe: 0.409210 hartree
zpe.sumelectzpe: -1179.258676 hartree
zpe.sumelectthermal: -1179.233286 hartree
zpe.sumelectthermalent: -1179.232341 hartree
zpe.sumelectthermalfe: -1179.311565 hartree
dipole: -4.9694 1.6710 1.7162
dipole: 5.5166
quadrupole: -206.0594 -148.3055 -156.4719
quadrupole: 13.5440 25.1125 0.4977
quadrupole: -35.7805 21.9735 13.8070 13.5440 25.1125 0.4977
hfenergy: -1179.7207744 hartree
pointgroup: C01 [X(C22H29F1O3)]
dipole: -1.9722566 -0.621591 -0.6591248 debye
polarizability: 305.1129355|4.0351183|222.1535602|23.6542805|5.4205548|188.4542283 unknown
InChI: InChI=1S/C22H29FO3/c1-12-9-18-16-6-5-15(13(2)24)20(16,3)11-19(26)22(18,23)21(4)8-7-14(25)10-17(12)21/h7-8,10,12,15-16,18-19,26H,5-6,9,11H2,1-4H3
charge 0 multiplicity 1
55 atoms
F  0.841878 0.319276 1.402166
O  -0.336504 2.231544 -1.53611
O  -5.725115 0.124394 -0.496177
O  5.702274 0.852515 1.432767
C  -1.475767 -1.028409 0.279525
C  -2.414226 0.17542 -0.059718
C  -0.103189 -0.961275 -0.425215
C  0.595515 0.380946 -0.077643
C  -3.682935 -0.252887 0.79017
C  -1.713689 1.468786 0.423707
C  -0.296987 1.665782 -0.175112
C  -2.370877 -2.270183 0.064736
C  2.040333 0.498779 -0.716391
C  0.790538 -2.159575 -0.019539
C  -3.781666 -1.799228 0.557052
C  2.247361 -2.081582 -0.565498
C  -2.793636 0.235114 -1.567344
C  2.848431 -0.718061 -0.234315
C  1.99598 0.486642 -2.289672
C  -4.963137 0.509039 0.43402
C  2.675093 1.826293 -0.336383
C  3.069921 -3.288819 -0.072641
C  4.025671 -0.565721 0.444335
C  3.852433 1.943255 0.33557
C  -5.279316 1.755489 1.250088
C  4.604304 0.749882 0.789388
H  -1.267206 -0.955244 1.368889
H  -0.251903 -0.98987 -1.523843
H  -3.437883 -0.040519 1.850309
H  -1.606481 1.424837 1.524724
H  -2.300466 2.377207 0.183879
H  0.220081 2.43708 0.420511
H  -2.01081 -3.149396 0.626181
H  -2.399032 -2.553659 -1.005003
H  0.324911 -3.09597 -0.380506
H  0.830969 -2.21432 1.085518
H  -4.567326 -2.010534 -0.188713
H  -4.072886 -2.306165 1.493758
H  2.182405 -2.154136 -1.6734
H  -3.528008 -0.543332 -1.832841
H  -3.272333 1.201138 -1.818662
H  -1.918514 0.088229 -2.228525
H  1.473557 -0.39948 -2.688467
H  1.483625 1.387813 -2.658279
H  3.032103 0.471182 -2.670246
H  2.153418 2.72056 -0.701585
H  -1.13734 1.900115 -2.01165
H  3.165669 -3.287523 1.028686
H  2.571892 -4.230559 -0.366898
H  4.086029 -3.296646 -0.505714
H  4.608327 -1.430947 0.77689
H  4.298478 2.91922 0.559124
H  -5.566907 1.4590 2.278232
H  -4.39122 2.406838 1.34735
H  -6.111337 2.314766 0.795014
