program: Gaussian 09
title: 000102161
version: EM64L-G09RevD.01
frameworkgroup: C1[X(C14H20N4O3)]
method: RPBEPBE
basis: SDD
operation: Freq
keyword: #p
keyword: freq=noraman
keyword: PBEPBE/SDD
title: #p freq=noraman PBEPBE/SDD
converged: YES YES NO NO
title: Mulliken charges:
elementType: O O O N N N N C C C C C C C C C C C C C C H H H H H H H H H H H H H H H H H H H H
charge: -0.260493 -0.260648 -0.237935 -0.571377 -0.020675 -0.465505 -0.651234 -0.351804 -0.404082 -0.242694 -0.452075 0.212237 0.217373 0.256271 0.169383 -0.538146 -0.358830 -0.369708 -0.219975 -0.229383 -0.225663 0.248633 0.205760 0.250543 0.202752 0.249765 0.228625 0.149512 0.285665 0.269070 0.315798 0.247855 0.218308 0.292771 0.268501 0.237796 0.313930 0.320218 0.233595 0.231824 0.234042
chargesum: 0.00000
title: Mulliken charges with hydrogens summed into heavy atoms:
elementType: O O O N N N N C C C C C C C C C C C C C C
charge: -0.260493 -0.260648 -0.237935 -0.016642 -0.020675 -0.149708 -0.017085 0.102589 0.049213 0.007071 -0.073937 0.212237 0.217373 0.256271 0.169383 0.220789 -0.090329 -0.131911 0.013620 0.002441 0.008379
polarizability: 2.52828439e+02 -2.50985371e+01 1.90276926e+02 -6.21683160e-02 1.16040513e+01 1.34941441e+02
1716.lowfreq: -10.0742 -7.0222 0.0003 0.0004 0.0005 6.8103 12.6041 20.2317 29.0467
frequency: 12.0989 19.7209 28.1034 38.3234 46.6895 63.1564 71.9039 87.0637 107.0114 122.2371 139.6869 149.7330 169.1726 190.1877 200.7598 231.1227 245.6405 257.1277 268.3164 288.3063 303.0003 324.2778 374.8961 393.7703 403.5946 409.9484 438.3479 464.7504 487.3650 498.5149 540.7966 581.1117 585.3708 614.3734 633.3834 635.6621 679.5934 691.4332 707.0613 719.4775 740.9970 757.6878 790.2889 797.2804 822.3471 859.0104 867.7533 877.1609 916.9726 936.6181 956.3550 967.2812 984.4863 990.5069 1004.6174 1016.6436 1026.7727 1055.5511 1082.1848 1084.9574 1112.7252 1115.6895 1123.5536 1132.9967 1147.9929 1160.7843 1168.6980 1174.1282 1187.9982 1188.9618 1239.7726 1244.7383 1264.4774 1290.9108 1304.7033 1312.8146 1316.3323 1349.1432 1363.9113 1369.4555 1384.5223 1411.1526 1431.1544 1447.2431 1454.3970 1455.5220 1465.6002 1468.0833 1480.1627 1487.9125 1581.4808 1607.5109 1608.9220 1615.5009 1633.4786 1658.8341 1685.8770 2861.9671 2984.2060 2987.0765 3001.6571 3002.1703 3043.4332 3044.2642 3066.9421 3121.5840 3121.9996 3127.2924 3132.6956 3145.1490 3157.1911 3169.2683 3436.3548 3527.1189 3529.6757 3553.6974 3671.1182
redmass: 4.6744 5.4697 5.8334 4.3632 5.1505 5.5108 5.4347 5.9678 3.1638 1.1706 3.9416 3.0813 3.3605 4.0715 2.3148 1.7009 2.8694 4.4667 2.3136 4.6471 3.0334 3.0383 3.1626 3.4003 2.9351 2.1868 1.9604 3.3036 1.2480 4.2726 3.5176 2.4048 1.5364 5.9679 3.6440 3.7380 5.4835 5.0676 1.5518 1.7537 3.5155 1.8413 2.4399 2.6922 3.0116 1.2595 6.3356 3.3285 3.4710 1.4809 2.5887 3.1039 1.5812 3.8884 1.3461 2.2688 2.1453 1.8228 1.6295 2.1759 2.2176 2.3969 3.3698 1.3450 2.1643 1.5295 1.6276 1.0577 1.1635 1.2841 1.6552 1.6793 1.5008 4.0076 1.1737 1.2923 1.3488 1.2776 1.3868 1.4315 9.2884 1.1950 2.2091 1.7702 1.0768 1.2437 1.0505 1.0960 2.2851 1.0566 6.1333 1.5611 5.1914 2.9132 8.8495 1.0905 7.2093 1.0680 1.0631 1.0651 1.0307 1.0761 1.0979 1.0874 1.1047 1.0870 1.1053 1.1065 1.0872 1.0919 1.0958 1.1012 1.0454 1.0539 1.0668 1.0955 1.1027
irintensity: 3.6536 0.4304 1.6811 0.6657 2.4046 1.6161 0.7852 3.9973 1.2218 0.3680 2.1059 1.7451 17.6913 6.5410 3.2946 60.0674 14.0424 2.1099 2.0115 2.9157 9.7704 45.1372 17.2672 1.3329 1.0944 7.7601 33.7104 15.5753 281.8122 7.9412 4.6250 29.6691 65.8350 1.2235 25.2690 33.5036 16.2392 4.6998 85.7052 171.5123 49.8432 11.6481 18.1560 11.0845 6.7085 1.3087 17.6128 21.1671 11.0661 4.7925 5.9697 18.9882 2.9771 0.4158 1.6477 2.4390 5.4422 8.1136 6.1905 61.9838 66.2467 53.1936 27.4366 6.4997 21.3536 11.6838 36.5797 0.8719 6.0132 6.7919 140.9971 105.3742 11.9955 52.4913 0.3469 6.6127 3.6766 25.9518 0.9233 2.5454 0.8924 33.9943 65.3165 405.6284 4.9053 135.5160 4.1048 14.9986 35.1160 10.9674 43.2681 72.1448 23.2558 75.2059 157.6377 69.0671 389.9168 112.8615 14.3611 17.8812 54.2273 52.6426 2.6654 18.4818 44.0928 6.8240 6.2594 11.6042 1.5790 17.5612 19.2574 22.2091 0.6254 12.1104 21.6132 1.6664 13.4967
temp: 298.150 k
press: 1.00000 atm
elementType: 8 8 8 7 7 7 7 6 6 6 6 6 6 6 6 6 6 6 6 6 6 1 1 1 1 1 1 1 1 1 1 1 1 1 1 1 1 1 1 1 1
symmnumber: 1
zpe: 872619.4 jmol-1
zpe.correction: 0.332363 hartree
zpe.thermalcorrener: 0.354716 hartree
zpe.thermalcorrenthalpy: 0.355660 hartree
zpe.thermalcorrgfe: 0.277363 hartree
zpe.sumelectzpe: -988.577392 hartree
zpe.sumelectthermal: -988.555038 hartree
zpe.sumelectthermalent: -988.554094 hartree
zpe.sumelectthermalfe: -988.632391 hartree
dipole: 4.7852 3.5212 -2.4637
dipole: 6.4317
quadrupole: -108.6596 -103.7686 -126.4641
quadrupole: -1.8697 3.7445 -0.1397
quadrupole: 4.3045 9.1955 -13.5000 -1.8697 3.7445 -0.1397
hfenergy: -988.9097547 hartree
pointgroup: C01 [X(C14H20N4O3)]
dipole: -2.0683161 1.2119346 0.8101493 debye
polarizability: 246.4171586|31.9356444|195.3687682|6.0859097|-12.138024|136.2608796 unknown
InChI: InChI=1S/C14H20N4O3/c1-21-13(20)11(15)8-5-9-17-14(16)18-12(19)10-6-3-2-4-7-10/h2-4,6-7,11,18H,5,8-9,15-16H2,1H3
charge 0 multiplicity 1
41 atoms
O  2.647942 -1.978304 0.885475
O  3.827154 -1.619891 -1.10514
O  -0.602917 -0.583898 0.495934
N  5.516613 0.264204 0.363822
N  0.622893 1.99822 -0.699793
N  -1.557814 1.526596 0.096181
N  -0.518377 3.479188 0.872173
C  3.173729 1.056558 0.784006
C  3.073926 1.710933 -0.61063
C  4.18562 -0.128214 0.855411
C  1.906542 2.723373 -0.687074
C  3.572578 -1.317462 0.085489
C  -0.369674 2.33483 0.064509
C  -2.95789 -0.474986 -0.082185
C  -1.597901 0.127269 0.178483
C  1.73886 -2.960668 0.236879
C  -3.264314 -1.70964 0.545164
C  -3.910327 0.119312 -0.951379
C  -4.513199 -2.327537 0.33008
C  -5.15804 -0.505216 -1.172927
C  -5.46544 -1.724704 -0.526678
H  2.178066 0.682613 1.089352
H  3.504848 1.813135 1.521656
H  2.903735 0.943361 -1.388552
H  4.020144 2.235727 -0.846685
H  4.2687 -0.427867 1.915028
H  1.985417 3.291552 -1.635827
H  2.017756 3.458834 0.149224
H  5.531487 0.371639 -0.658195
H  6.258162 -0.379472 0.662503
H  -2.447003 2.025151 0.015111
H  2.118549 -3.221229 -0.764899
H  1.715352 -3.844214 0.893569
H  0.750276 -2.478571 0.178325
H  -2.507443 -2.16711 1.190898
H  -3.667189 1.039318 -1.497001
H  -1.103306 3.433586 1.705239
H  0.197174 4.202356 0.840017
H  -4.745289 -3.277034 0.824574
H  -5.882142 -0.049025 -1.856752
H  -6.434059 -2.207214 -0.698086
