program: Gaussian 09
title: 000100095
version: EM64L-G09RevD.01
frameworkgroup: C1[X(C12H22N2O5)]
method: RPBEPBE
basis: SDD
operation: Freq
keyword: #p
keyword: freq=noraman
keyword: PBEPBE/SDD
title: #p freq=noraman PBEPBE/SDD
converged: YES YES NO NO
title: Mulliken charges:
elementType: O O O O O N N C C C C C C C C C C C C H H H H H H H H H H H H H H H H H H H H H H
charge: -0.318881 -0.403979 -0.231795 -0.345546 -0.287055 -0.401556 -0.343475 -0.383555 -0.390607 -0.148193 -0.436400 0.332179 -0.352552 0.144763 -0.707759 -0.698310 -0.704032 0.343942 -0.058551 0.220691 0.215805 0.218648 0.231663 0.277835 0.212404 0.213829 0.234923 0.234323 0.351482 0.263521 0.223164 0.215386 0.229670 0.230421 0.207278 0.226936 0.246227 0.218129 0.373806 0.390709 0.154510
chargesum: 0.00000
title: Mulliken charges with hydrogens summed into heavy atoms:
elementType: O O O O O N N C C C C C C C C C C C C
charge: -0.318881 -0.013270 -0.231795 -0.345546 -0.287055 -0.050074 0.030331 0.052941 0.059704 0.129641 -0.010167 0.332179 0.116694 0.144763 -0.005688 -0.030941 -0.012739 0.343942 0.095959
polarizability: 1.92480902e+02 -1.17956894e+00 1.78063178e+02 -1.40092505e+00 2.59467706e+00 1.19271524e+02
1716.lowfreq: -10.1426 -4.6881 -0.0007 -0.0006 -0.0004 4.3713 19.4241 31.4802 40.3119
frequency: 19.1097 31.4396 40.2386 53.3262 58.3891 65.7918 78.3738 105.3503 123.6516 129.5643 152.6918 170.6837 175.9194 190.0471 215.6548 234.6791 242.8660 244.6715 251.0260 279.2205 290.3536 306.8035 329.5941 347.0059 364.3842 390.6275 405.5229 432.4355 439.6082 498.6742 535.1666 573.3056 603.5033 622.9790 688.0944 698.9196 707.6177 718.4733 746.2483 753.9243 792.7452 808.6696 825.3370 849.1176 900.4504 914.7387 920.5527 938.1032 952.5566 960.6318 963.0781 990.7684 1028.4927 1030.7600 1046.0036 1062.6431 1079.5600 1089.9460 1098.2201 1144.4065 1162.3785 1185.4805 1205.2108 1222.9883 1228.8570 1235.0747 1257.5885 1259.5164 1270.8679 1292.7216 1302.7256 1325.2643 1334.1930 1341.8954 1347.4701 1366.8324 1369.4963 1374.9592 1377.8705 1400.3491 1445.0704 1458.0964 1463.6508 1466.0653 1466.9262 1469.4226 1477.3646 1483.0103 1488.3497 1491.9877 1501.0758 1517.9090 1616.5814 1638.3418 1654.8592 2904.9532 2975.0184 2981.8316 2986.4761 2991.6996 2993.1702 2995.1553 2998.0542 3023.5830 3032.7320 3037.6521 3052.7521 3060.3067 3084.2958 3087.5670 3099.4547 3101.5830 3113.1902 3116.9212 3366.5875 3516.4597 3525.5591
redmass: 4.6020 3.7926 4.2721 8.1717 5.1701 5.9607 4.5660 4.0871 4.6582 4.6451 3.5807 1.6829 1.6851 5.3849 2.9005 1.0866 1.4097 1.7239 2.8010 3.4507 4.5807 3.8033 2.6012 2.5165 2.4593 3.2830 2.7763 2.8112 2.5097 2.7953 3.3676 1.8226 2.1430 1.2926 3.3515 5.7643 9.0463 3.1506 1.9452 3.1264 1.1244 2.7051 2.3544 1.9832 3.4355 1.5914 1.6928 2.3949 1.2157 1.5730 2.0220 4.1263 1.4208 1.4322 2.5760 2.8431 2.2319 2.7022 2.4122 2.5425 2.0547 1.4791 1.3523 1.6545 1.5744 1.8869 3.0116 1.4116 2.8726 1.2709 1.3399 1.3122 1.3448 1.4322 1.8345 1.2653 1.4473 1.2334 1.2343 1.2150 1.0473 1.1083 1.1028 1.0524 1.0558 1.0678 1.0533 1.0864 1.0790 1.7131 1.1176 1.5868 7.8496 5.3323 8.6342 1.0848 1.0608 1.0624 1.0605 1.0361 1.0357 1.0615 1.0366 1.0987 1.0983 1.0873 1.1008 1.1014 1.0994 1.0993 1.0993 1.1005 1.1000 1.0992 1.0835 1.0643 1.0768
irintensity: 2.9120 0.3742 1.4166 0.3550 2.4344 1.7523 1.9969 2.2893 4.8724 5.6079 8.0444 2.4362 2.3316 0.7882 16.7126 0.0768 0.0347 1.5301 1.9336 0.6569 0.7087 13.3425 2.3367 10.3709 21.5017 14.3521 6.1411 4.3261 6.7298 2.3838 10.7453 63.5604 93.4245 73.2471 60.5911 5.2495 37.5244 13.9844 26.7976 10.4337 131.0299 8.0172 12.4733 7.4551 43.3103 1.1582 3.5881 18.2066 0.2844 0.3961 4.2660 172.0993 0.3123 10.4247 73.5487 108.9660 7.4224 5.1487 0.3203 102.0882 286.3064 3.0416 9.6253 36.7393 35.3431 38.2901 26.6741 34.2017 5.6481 11.1636 13.1103 35.8686 3.6550 7.9823 143.4682 15.5547 2.9981 41.4198 40.1008 30.6723 0.5149 70.0350 5.1598 11.3679 2.7122 19.5816 5.0094 22.1145 7.6112 229.5942 94.9426 210.5269 428.4001 223.1151 163.4926 153.0927 20.2740 18.7755 39.5338 19.3400 11.2324 30.0350 21.7510 20.8769 19.7778 4.0691 47.5821 59.0650 9.1397 12.6637 47.9707 26.3948 5.9658 23.6597 430.4066 40.9519 70.0549
temp: 298.150 k
press: 1.00000 atm
elementType: 8 8 8 8 8 7 7 6 6 6 6 6 6 6 6 6 6 6 6 1 1 1 1 1 1 1 1 1 1 1 1 1 1 1 1 1 1 1 1 1 1
symmnumber: 1
zpe: 892762.1 jmol-1
zpe.correction: 0.340035 hartree
zpe.thermalcorrener: 0.362060 hartree
zpe.thermalcorrenthalpy: 0.363004 hartree
zpe.thermalcorrgfe: 0.287364 hartree
zpe.sumelectzpe: -954.630449 hartree
zpe.sumelectthermal: -954.608424 hartree
zpe.sumelectthermalent: -954.607480 hartree
zpe.sumelectthermalfe: -954.683120 hartree
dipole: -4.6582 -4.1620 0.1634
dipole: 6.2488
quadrupole: -113.6712 -130.2847 -113.5884
quadrupole: -31.6856 -0.9700 -0.8329
quadrupole: 5.5102 -11.1032 5.5931 -31.6856 -0.9700 -0.8329
hfenergy: -954.9704842 hartree
pointgroup: C01 [X(C12H22N2O5)]
dipole: 1.5457886 1.9083316 -0.1138099 debye
polarizability: 192.4366628|1.4437517|176.982035|2.4507474|-8.2205838|120.3969061 unknown
InChI: InChI=1S/C12H22N2O5/c1-12(2,3)19-11(18)14-9(10(16)17)6-4-5-7-13-8-15/h8-9,13-14,16H,4-7H2,1-3H3
charge 0 multiplicity 1
41 atoms
O  -0.973601 2.039586 -0.661401
O  4.410184 0.578297 0.851038
O  3.568813 2.303988 -0.459007
O  -0.608075 0.162539 0.741969
O  -2.858383 -4.31777 0.21342
N  1.088786 1.133422 -0.544639
N  -1.240404 -2.666551 0.588584
C  2.504167 -0.940663 -0.92145
C  1.365602 -1.986233 -0.944498
C  2.179538 0.302357 -0.025512
C  1.228153 -2.778817 0.378617
C  -2.465317 2.172551 -0.35163
C  -0.085941 -3.579326 0.481107
C  3.418862 1.187586 0.08615
C  -2.650046 2.447401 1.153497
C  -2.849119 3.395162 -1.20232
C  -3.200259 0.903334 -0.824224
C  -0.204649 1.037797 -0.082969
C  -2.528675 -3.115928 0.446615
H  3.433808 -1.404077 -0.538918
H  2.709646 -0.578662 -1.947609
H  1.558514 -2.698879 -1.77041
H  0.409757 -1.486244 -1.187701
H  1.900725 -0.050512 0.983724
H  2.079331 -3.480037 0.477412
H  1.28555 -2.092643 1.247052
H  -0.057931 -4.250399 1.36277
H  -0.228873 -4.231914 -0.401592
H  1.336769 1.928782 -1.140447
H  -2.329137 1.584382 1.757615
H  -2.069434 3.3361 1.458172
H  -3.717264 2.647229 1.359987
H  -2.661689 3.200128 -2.272118
H  -2.261763 4.278786 -0.89961
H  -3.921692 3.621705 -1.068043
H  -2.969299 0.691983 -1.883159
H  -2.923035 0.028284 -0.215932
H  -4.290883 1.058118 -0.735532
H  -1.063352 -1.665653 0.769674
H  5.218698 1.158585 0.880989
H  -3.280182 -2.297795 0.559131
