program: Gaussian 09
title: 000100094
version: EM64L-G09RevD.01
frameworkgroup: C1[X(C16H19N3O5)]
method: RPBEPBE
basis: SDD
operation: Freq
keyword: #p
keyword: freq=noraman
keyword: PBEPBE/SDD
title: #p freq=noraman PBEPBE/SDD
converged: YES YES NO NO
title: Mulliken charges:
elementType: O O O O O N N N C C C C C C C C C C C C C C C C H H H H H H H H H H H H H H H H H H H
charge: -0.308395 -0.425441 -0.219425 -0.396810 -0.280611 -0.388164 -0.430493 -0.600153 -0.533838 -0.137668 0.353742 0.104438 -0.222394 0.235075 -0.422164 -0.406711 0.234353 0.142563 -0.403318 -0.514457 -0.358537 -0.255891 -0.219438 0.232637 0.216792 0.258655 0.285308 0.259313 0.359279 0.239212 0.215941 0.309422 0.304892 0.230150 0.297369 0.244232 0.226467 0.309965 0.261303 0.217747 0.219071 0.385583 0.380397
chargesum: 0.00000
title: Mulliken charges with hydrogens summed into heavy atoms:
elementType: O O O O O N N N C C C C C C C C C C C C C C C C
charge: -0.308395 -0.039858 -0.219425 -0.016413 -0.280611 -0.028884 -0.125601 -0.028885 -0.058391 0.147641 0.353742 0.104438 0.036920 0.235075 0.032988 -0.097289 0.234353 0.142563 -0.173168 0.027144 -0.132070 -0.038144 -0.000367 0.232637
polarizability: 2.58172127e+02 4.46625442e+00 2.01891432e+02 -2.49367161e+01 2.47772896e+01 1.67658043e+02
1716.lowfreq: -16.2084 -4.9089 -0.0009 -0.0008 -0.0004 3.2090 10.1674 18.6682 37.2287
frequency: 6.8408 18.5643 37.1608 39.6771 41.8749 69.1975 78.9585 87.6977 95.4750 126.9462 135.2319 153.2201 157.7022 194.8118 209.6486 223.8773 238.9029 283.8267 290.6444 309.0855 320.1433 325.4172 353.2737 398.5216 418.7851 423.1798 450.1043 466.5312 510.5836 528.7015 535.9492 548.6072 562.5830 575.8995 576.3727 587.7444 608.8963 624.6657 635.2305 649.8563 681.4156 702.7585 724.0501 734.8901 746.8979 758.8208 762.0129 777.5935 794.3712 822.7942 825.5132 849.3859 869.0191 879.0701 895.1637 924.2864 929.4998 967.9577 973.9831 1000.8716 1011.2392 1020.6821 1049.9906 1062.0783 1077.6104 1082.5950 1106.0657 1113.3083 1136.2756 1140.2237 1162.5247 1166.3300 1185.4392 1201.2126 1210.5641 1234.1460 1256.2672 1257.2796 1274.6537 1292.9546 1294.1697 1303.4789 1311.1534 1315.5769 1323.8861 1328.3355 1359.5497 1363.4175 1392.1955 1394.1542 1422.2603 1458.2058 1462.8497 1466.0829 1473.3863 1481.1544 1538.7347 1568.3073 1578.5584 1587.3311 1623.2631 1633.0390 1640.2541 1654.5488 2960.6998 2972.9465 2987.3613 2998.6980 3020.7422 3024.1758 3056.9273 3097.6039 3120.7282 3128.5852 3142.4547 3160.4615 3205.1303 3350.8674 3457.7790 3499.4679 3504.4382 3603.4286 3616.2795
redmass: 6.7598 5.2902 6.5237 6.6806 7.4234 6.8664 5.6578 5.9583 9.0950 4.7123 4.8532 4.3658 6.4021 3.1954 6.5512 4.1251 3.0580 1.4489 3.2812 4.4074 2.8157 4.7876 4.2051 3.4299 3.2141 2.8577 4.0266 2.9117 1.2455 4.7190 3.8055 4.1621 2.2086 2.4637 2.8311 2.7875 3.1310 2.2039 1.3488 2.6368 2.7210 3.8333 4.1059 5.0085 1.3179 3.5950 5.0017 1.3131 2.1842 2.0590 1.8884 1.4581 5.0841 2.9075 2.4279 4.0196 1.3981 1.2978 2.5029 2.2389 2.1071 3.7012 4.2046 3.2245 2.1465 1.7659 1.7787 3.0302 1.6106 1.7823 1.5324 1.0843 1.2686 1.2821 1.4934 2.2716 1.8881 1.7338 1.4020 1.6322 1.5822 1.6338 1.9161 1.2583 1.2051 1.5850 1.7443 1.7109 1.7660 4.3354 2.3126 1.0900 4.0777 1.1143 1.1048 3.0103 2.0020 5.1052 1.7773 5.9010 3.6661 6.3563 2.2281 8.8890 1.0708 1.0731 1.0605 1.0848 1.0613 1.0958 1.1015 1.1034 1.0846 1.0889 1.0953 1.1002 1.1003 1.0831 1.0453 1.0638 1.0637 1.0980 1.0809
irintensity: 1.0054 0.0952 2.2257 2.2006 0.1299 0.5574 1.2878 3.0812 5.5317 1.6495 5.7574 0.3779 5.0304 3.7009 1.0486 8.5216 1.5844 72.0983 6.1428 1.4168 8.6794 2.9123 9.0433 3.8247 5.6554 11.2699 4.9699 16.7098 95.5475 16.6547 44.2314 70.6209 58.2737 128.3723 74.4709 36.5329 3.2124 55.6314 88.3005 16.2593 57.9550 47.4965 21.3127 4.4325 112.4763 11.5313 5.5969 154.4489 31.4166 17.0006 10.5758 2.8042 0.0866 13.0094 17.5310 86.6886 1.4972 0.0260 23.5379 58.1555 15.6063 30.0860 3.5579 59.5219 50.9051 310.6135 25.4491 5.0019 28.8297 6.5521 6.9159 0.2561 29.1628 11.4129 5.6633 16.7818 48.9060 18.7167 29.0268 64.8046 15.9071 4.7721 0.7142 6.3938 5.8826 19.9644 48.4395 14.3790 11.4294 40.7414 4.7534 1.9696 22.6374 23.8412 13.0496 1.7480 241.9701 5.8209 148.6583 1.3464 276.7842 0.6211 27.9749 248.5096 34.2004 12.2670 32.6103 24.6381 21.4970 11.2743 20.2931 5.5603 1.6051 4.6700 39.1087 33.7458 15.3795 300.6514 20.6897 29.7886 31.9774 10.8912 55.1490
temp: 298.150 k
press: 1.00000 atm
elementType: 8 8 8 8 8 7 7 7 6 6 6 6 6 6 6 6 6 6 6 6 6 6 6 6 1 1 1 1 1 1 1 1 1 1 1 1 1 1 1 1 1 1 1
symmnumber: 1
zpe: 887897.4 jmol-1
zpe.correction: 0.338182 hartree
zpe.thermalcorrener: 0.361224 hartree
zpe.thermalcorrenthalpy: 0.362168 hartree
zpe.thermalcorrgfe: 0.282284 hartree
zpe.sumelectzpe: -1159.748069 hartree
zpe.sumelectthermal: -1159.725027 hartree
zpe.sumelectthermalent: -1159.724083 hartree
zpe.sumelectthermalfe: -1159.803967 hartree
dipole: 4.6301 -1.4485 1.6817
dipole: 5.1346
quadrupole: -121.9001 -134.8867 -139.0631
quadrupole: 8.8714 5.6391 6.2664
quadrupole: 10.0499 -2.9367 -7.1132 8.8714 5.6391 6.2664
hfenergy: -1160.086251 hartree
pointgroup: C01 [X(C16H19N3O5)]
dipole: -1.7918359 0.9072968 -0.2167351 debye
polarizability: 248.8090849|20.5429596|165.394795|27.5302862|-20.279832|213.517723 unknown
InChI: InChI=1S/C16H19N3O5/c17-11(5-6-14(20)21)15(22)19-13(16(23)24)7-9-8-18-12-4-2-1-3-10(9)12/h1-4,8,11,13,18-20,23H,5-7,17H2
charge 0 multiplicity 1
43 atoms
O  -0.698424 -0.235495 -2.644702
O  -2.639662 -2.422007 0.027769
O  -0.908031 -3.682315 0.904736
O  -5.254607 1.810988 1.019035
O  -3.063975 1.149205 1.330133
N  -1.091523 -0.236426 -0.347609
N  3.37163 0.694712 -0.965531
N  -1.466742 2.375688 -2.824557
C  0.807331 -1.333367 0.889639
C  -0.370866 -1.487725 -0.109553
C  1.951044 -0.494807 0.373172
C  3.095205 -0.073603 1.164925
C  -2.023845 1.610497 -1.703074
C  3.970699 0.673914 0.298216
C  -3.551339 1.301882 -1.886537
C  2.15665 -0.006553 -0.918452
C  -1.213083 0.300238 -1.606528
C  -1.286552 -2.633083 0.342564
C  3.466618 -0.256626 2.523719
C  -4.245081 0.493779 -0.7438
C  5.184743 1.23528 0.751308
C  4.676323 0.300985 2.982054
C  5.526083 1.039555 2.105502
C  -4.098206 1.150651 0.608556
H  0.417312 -0.901014 1.834746
H  1.158732 -2.351863 1.144298
H  0.030262 -1.796985 -1.09902
H  -1.888896 2.17854 -0.763096
H  -1.563842 0.237456 0.439997
H  -3.67679 0.7309 -2.825965
H  -4.073136 2.270484 -2.017539
H  1.526858 -0.090654 -1.803779
H  3.736085 1.170581 -1.78729
H  2.825165 -0.824735 3.20744
H  -3.790312 -0.510604 -0.677922
H  -5.317324 0.390577 -0.976519
H  5.841843 1.802115 0.081988
H  -1.124353 1.77265 -3.580663
H  -2.023973 3.175659 -3.131462
H  4.975249 0.167713 4.027852
H  6.461196 1.460813 2.491582
H  -3.152786 -3.229119 0.307929
H  -5.098377 2.240117 1.905139
