program: Gaussian 09
title: 000100091
version: EM64L-G09RevD.01
frameworkgroup: C1[X(C22H24N2O5)]
method: RPBEPBE
basis: SDD
operation: Freq
keyword: #p
keyword: freq=noraman
keyword: PBEPBE/SDD
title: #p freq=noraman PBEPBE/SDD
converged: YES YES NO NO
title: Mulliken charges:
elementType: O O O O O N N C C C C C C C C C C C C C C C C C C C C C C H H H H H H H H H H H H H H H H H H H H H H H H
charge: -0.279960 -0.409831 -0.226091 -0.310309 -0.293155 -0.158972 -0.408025 -0.135730 -0.476657 -0.473158 -0.370213 0.206865 -0.191404 0.189915 -0.612445 0.541790 0.293652 -0.390013 -0.394197 -0.237626 -0.224093 -0.237519 -0.403011 0.474313 -0.371273 -0.432941 -0.218891 -0.220318 -0.241452 0.313405 0.241697 0.250694 0.246560 0.238750 0.239623 0.244509 0.284885 0.225714 0.239600 0.346706 0.381847 0.235051 0.216935 0.223859 0.221148 0.225728 0.224854 0.254116 0.245133 0.231151 0.225278 0.225724 0.227780
chargesum: 0.00000
title: Mulliken charges with hydrogens summed into heavy atoms:
elementType: O O O O O N N C C C C C C C C C C C C C C C C C C C C C C
charge: -0.279960 -0.027984 -0.226091 -0.310309 -0.293155 -0.158972 -0.061319 0.177676 0.015734 0.012151 0.113920 0.206865 0.093481 0.189915 -0.147131 0.541790 0.293652 -0.154962 -0.177262 -0.013767 -0.002945 -0.011792 0.075959 0.474313 -0.126140 -0.201790 0.006388 0.005406 -0.013672
polarizability: 3.06795198e+02 1.92402051e+01 2.78283196e+02 -2.35017762e+01 2.21887380e+01 1.91778984e+02
1716.lowfreq: -5.5719 -3.6231 -0.0006 -0.0005 0.0003 5.5127 7.6546 17.0470 20.8501
frequency: 4.3762 16.1785 20.7575 21.8362 25.7980 29.5511 35.3818 45.5662 58.7613 61.4631 67.9715 93.3260 102.8785 123.9819 137.9004 150.7253 158.5037 175.0965 215.2911 229.6664 247.9500 258.4697 283.2066 301.6396 321.1842 338.6369 353.7905 391.3574 402.3296 402.5756 416.9980 458.6576 492.4279 507.8693 546.8015 558.8093 560.0262 572.6756 598.0993 616.4910 618.5803 624.2995 629.3602 668.3278 692.4484 696.5898 700.8935 701.7389 702.5693 741.2642 745.0879 760.4831 793.9941 816.3005 826.0855 847.8233 853.0256 855.3894 867.0528 871.0430 903.0264 907.8505 913.9304 921.2486 923.4486 968.5364 971.8709 976.3081 984.6743 989.7503 990.4044 991.4086 993.4508 997.7680 1008.2929 1016.2044 1028.1582 1028.4118 1047.6609 1064.4214 1083.0563 1087.3539 1099.1628 1124.5256 1149.2030 1166.3614 1171.5455 1172.2546 1177.6315 1186.5594 1188.4349 1188.8883 1209.4396 1217.1459 1221.7214 1225.1005 1238.6494 1251.0597 1254.0504 1269.6232 1303.1163 1310.7668 1315.5494 1323.0044 1327.7130 1331.4807 1337.5518 1354.5189 1358.2973 1385.2482 1388.0652 1401.6861 1441.0148 1442.8332 1464.8585 1471.2667 1474.5222 1476.8317 1484.1342 1486.3698 1488.7848 1491.2971 1582.2107 1595.5671 1595.9806 1615.7817 1618.0510 1659.2217 1665.5836 2984.5982 2992.1804 2994.7777 3023.0594 3025.9439 3046.5611 3051.0017 3053.9528 3063.0853 3069.6005 3092.3240 3104.6955 3108.2516 3116.2214 3120.1799 3126.4937 3132.3174 3139.2552 3144.2318 3151.8429 3162.0896 3165.0519 3517.2545 3534.5966
redmass: 4.7566 5.2282 4.7136 4.0699 4.1888 6.6273 5.1734 7.4936 6.1274 7.9126 7.6417 4.9462 3.8026 4.6765 4.7225 5.2094 3.5996 4.5264 5.1487 4.1148 4.1535 2.5215 3.8673 7.9749 4.4007 3.8036 2.9988 6.0657 2.8080 2.8115 3.0399 3.1661 3.8357 4.4235 2.6309 4.9198 3.2676 3.5053 2.0075 4.9737 5.3688 1.3820 2.0498 5.7291 9.3747 5.3081 4.3233 2.0367 1.8529 4.3592 1.5674 2.0896 2.9091 3.8931 4.7330 1.2697 1.3371 2.7188 2.1667 2.1123 2.1211 1.3688 2.0415 2.4196 2.0336 2.6848 1.4000 1.3935 3.4940 5.0568 4.8484 1.6738 1.6138 1.7465 2.3868 2.7493 2.1697 2.1764 2.6129 1.7383 1.6970 1.5791 1.8880 2.4532 1.4949 1.5067 1.0596 1.0751 1.6318 1.2156 1.8245 1.2442 1.2113 1.8806 2.1530 1.9519 1.2966 1.5184 1.5014 1.6610 1.3283 1.3967 1.3623 1.3642 1.3275 1.2754 1.4005 1.5877 1.6652 7.7490 5.3621 5.4674 2.1544 2.1858 1.1905 1.0856 1.1097 1.1986 2.1365 2.0905 1.3801 1.3612 7.9079 6.0986 6.1724 6.2209 6.1018 10.2771 8.7535 1.0622 1.0570 1.0605 1.0639 1.0642 1.0916 1.1057 1.0999 1.0945 1.0859 1.1020 1.1052 1.0878 1.0868 1.0858 1.0866 1.0909 1.0920 1.0960 1.0956 1.1015 1.1013 1.0642 1.0770
irintensity: 0.0700 0.1906 0.2504 1.1170 0.6918 0.4631 1.0433 0.7139 2.1969 3.2763 3.7917 0.2718 5.5700 1.3231 0.2523 4.5475 2.1467 1.5120 4.2698 14.6229 3.7863 6.0202 4.4773 9.9401 4.7783 9.1907 8.1371 21.1276 0.3050 0.6303 0.5343 18.1556 20.7482 5.7290 38.9584 2.9407 4.5203 43.7689 27.8456 6.3311 6.7147 116.5468 82.2816 17.2171 25.0763 15.9469 18.6218 46.8063 22.4250 34.3292 78.6897 25.6381 4.4298 3.6553 11.6839 0.2277 0.8593 4.7158 5.5037 4.9617 10.3229 2.3586 3.8474 8.0418 0.5542 2.1935 0.4962 0.9046 173.6283 0.6475 2.4404 2.4704 9.1461 30.5445 7.1873 123.2825 2.0006 15.8026 307.5813 14.9474 34.4963 12.9280 16.2697 55.4183 2.3413 10.4267 2.9166 5.3562 139.2663 2.4709 30.1456 4.4802 2.5888 66.8759 20.8398 3.1829 7.7162 7.5534 38.8447 12.2749 0.9762 28.1460 4.7007 30.8499 3.5281 7.1273 3.1203 22.6670 31.5352 2.5463 28.1481 379.7633 12.0262 5.7429 115.7412 9.1208 9.6712 68.2698 56.3460 25.4104 68.8269 145.3370 226.0671 0.4904 1.7798 6.0521 5.0359 216.8057 176.7898 31.9548 28.1326 26.2240 21.9118 19.5301 2.3002 18.3003 18.2129 22.1092 4.9863 18.4626 28.7022 16.0405 8.0238 2.5882 0.2691 13.1394 23.2976 43.6590 38.2764 24.1415 18.0867 33.0996 64.4989
temp: 298.150 k
press: 1.00000 atm
elementType: 8 8 8 8 8 7 7 6 6 6 6 6 6 6 6 6 6 6 6 6 6 6 6 6 6 6 6 6 6 1 1 1 1 1 1 1 1 1 1 1 1 1 1 1 1 1 1 1 1 1 1 1 1
symmnumber: 1
zpe: 1111551.1 jmol-1
zpe.correction: 0.423367 hartree
zpe.thermalcorrener: 0.450732 hartree
zpe.thermalcorrenthalpy: 0.451676 hartree
zpe.thermalcorrgfe: 0.357573 hartree
zpe.sumelectzpe: -1336.284619 hartree
zpe.sumelectthermal: -1336.257254 hartree
zpe.sumelectthermalent: -1336.256310 hartree
zpe.sumelectthermalfe: -1336.350413 hartree
dipole: -3.0016 -1.0228 2.1246
dipole: 3.8171
quadrupole: -137.1076 -161.1203 -169.3614
quadrupole: 11.7088 -13.3165 -1.9255
quadrupole: 18.7555 -5.2572 -13.4983 11.7088 -13.3165 -1.9255
hfenergy: -1336.7079864 hartree
pointgroup: C01 [X(C22H24N2O5)]
dipole: -1.1829902 -0.4444111 0.8113475 debye
polarizability: 306.7026482|20.1390295|277.269625|-22.1205295|24.8425832|192.8851045 unknown
InChI: InChI=1S/C22H24N2O5/c25-20(24-13-7-12-19(24)21(26)27)18(14-16-8-3-1-4-9-16)23-22(28)29-15-17-10-5-2-6-11-17/h1-6,8-11,18-19,23,26H,7,12-15H2
charge 0 multiplicity 1
53 atoms
O  -1.687804 -1.577978 -1.415647
O  -5.335005 -3.033307 -1.739041
O  -5.108551 -0.733483 -1.479767
O  2.529137 -0.028176 -0.20495
O  1.25064 0.802338 1.605168
N  -3.027841 -1.187029 0.434176
N  0.272519 0.080158 -0.407023
C  -3.936634 -2.292599 0.072271
C  -4.780803 -2.497112 1.364111
C  -4.845332 -1.073352 1.974669
C  -3.446224 -0.480743 1.677699
C  -1.955416 -0.890885 -0.375078
C  -1.111127 0.346945 -0.020201
C  -4.82103 -1.892557 -1.116928
C  -1.717249 1.580863 -0.785989
C  -0.991428 2.879472 -0.481521
C  1.32531 0.333686 0.438288
C  0.105634 3.30065 -1.275537
C  -1.380767 3.686969 0.61782
C  0.79955 4.494488 -0.975978
C  -0.690968 4.881104 0.921383
C  0.404152 5.288642 0.124653
C  3.770583 0.223849 0.570196
C  4.790928 -0.844728 0.238929
C  4.412454 -2.204978 0.114305
C  6.156123 -0.494559 0.096151
C  5.384552 -3.196378 -0.141903
C  7.131757 -1.487217 -0.150841
C  6.748702 -2.842433 -0.270434
H  -3.370038 -3.191284 -0.219923
H  -4.240345 -3.187631 2.035902
H  -5.772005 -2.92897 1.152582
H  -5.620734 -0.475904 1.464325
H  -5.068349 -1.083023 3.054011
H  -3.486953 0.611617 1.523474
H  -2.732175 -0.691511 2.497454
H  -1.109258 0.556218 1.063037
H  -2.788426 1.660336 -0.517617
H  -1.675919 1.347569 -1.866187
H  0.431875 -0.423161 -1.284027
H  -5.912784 -2.765062 -2.504034
H  0.415931 2.690719 -2.132322
H  -2.231996 3.380395 1.240048
H  1.644502 4.805556 -1.600934
H  -1.005845 5.493123 1.774286
H  0.940501 6.21546 0.357592
H  4.142863 1.229564 0.302365
H  3.502689 0.230461 1.644265
H  3.354771 -2.476263 0.199279
H  6.45934 0.557065 0.176014
H  5.079745 -4.244307 -0.242331
H  8.184442 -1.202217 -0.258218
H  7.502304 -3.6130 -0.46812
