program: Gaussian 09
title: 000100084
version: EM64L-G09RevD.01
frameworkgroup: C1[X(C14H24N4O6)]
method: RPBEPBE
basis: SDD
operation: Freq
keyword: #p
keyword: freq=noraman
keyword: PBEPBE/SDD
title: #p freq=noraman PBEPBE/SDD
converged: YES YES NO NO
title: Mulliken charges:
elementType: O O O O O O N N N N C C C C C C C C C C C C C C H H H H H H H H H H H H H H H H H H H H H H H H
charge: -0.318348 -0.267118 -0.298478 -0.428764 -0.219892 -0.290255 -0.358760 -0.383461 -0.399657 -0.389427 -0.171251 -0.201140 0.227504 -0.161425 0.244546 -0.669397 0.194125 -0.730954 -0.115747 -0.676496 -0.675014 0.164075 0.248192 -0.773409 0.266842 0.272835 0.322123 0.264878 0.354211 0.226102 0.275453 0.205609 0.223309 0.245344 0.241550 0.285031 0.394640 0.274556 0.206580 0.221120 0.342884 0.214823 0.258063 0.246609 0.249446 0.249719 0.216383 0.392441
chargesum: 0.00000
title: Mulliken charges with hydrogens summed into heavy atoms:
elementType: O O O O O O N N N N C C C C C C C C C C C C C C
charge: -0.318348 -0.267118 -0.298478 -0.036324 -0.219892 -0.290255 -0.036637 -0.029250 -0.005017 -0.046543 0.095591 0.071695 0.227504 0.103453 0.244546 0.037767 0.194125 -0.020752 0.169284 0.025761 0.044481 0.164075 0.248192 -0.057861
polarizability: 2.42662852e+02 1.19760364e+01 1.98789817e+02 -3.60946699e-01 -1.02864802e+01 1.59081922e+02
1716.lowfreq: -3.8798 -0.0011 -0.0010 -0.0009 0.9030 4.5203 11.4993 14.9463 18.8077
frequency: 11.3745 14.8019 18.7870 30.0741 37.8105 39.3509 54.3097 67.8431 75.8947 84.2027 84.9170 101.2119 105.4497 113.4901 125.9296 137.9251 172.1148 186.8052 195.2298 205.1894 224.1394 230.5145 239.1643 244.8266 248.5166 274.1465 284.0227 297.1750 316.5149 319.1697 333.0291 376.3896 408.2389 414.6592 437.1181 460.7538 530.3445 538.3093 550.3935 571.8726 582.9648 602.8740 609.3340 627.8170 638.3390 663.0883 678.7130 688.8559 698.5353 722.3212 735.7593 745.2361 751.4396 790.6128 861.1936 878.4388 883.0455 898.6011 910.2191 932.2786 945.1951 958.4804 991.6457 1008.9893 1033.7729 1043.4972 1050.2425 1055.7912 1072.8378 1080.3807 1090.3330 1101.1025 1118.7308 1122.8452 1145.5567 1159.0007 1177.7399 1215.0828 1225.7529 1230.8363 1243.2326 1271.5183 1279.2740 1295.7378 1300.4518 1314.8199 1324.2819 1329.1193 1334.8775 1347.6879 1378.6686 1384.6310 1386.5503 1389.0889 1396.2798 1451.2774 1453.2699 1455.7562 1459.1750 1465.9550 1468.1580 1474.9308 1477.4341 1477.8986 1481.0655 1484.0474 1494.2060 1505.5092 1508.3225 1581.2293 1595.5751 1613.3977 1623.4091 1671.6763 2990.4144 2990.7493 2992.4649 2996.3263 2997.4936 2998.0086 2999.6500 3023.3077 3023.8012 3089.0521 3090.6185 3096.4714 3099.5041 3101.5003 3103.4391 3108.5261 3111.4859 3112.4311 3114.8288 3421.6706 3461.4780 3473.6517 3523.9435 3538.6317
redmass: 5.7704 4.8557 3.6476 6.3190 6.1293 4.8627 4.9196 7.1261 6.4323 1.3303 3.6136 3.4824 6.4194 3.1755 4.0398 3.3920 4.7608 2.1265 1.4595 2.8127 1.5224 1.5616 2.3654 1.3097 1.3612 3.4211 5.0683 3.4004 4.7756 7.2542 4.4277 3.7253 3.7771 4.5038 3.5694 3.1563 3.4867 3.5145 3.0955 1.3355 3.8614 3.8393 1.3543 4.2188 3.7018 2.1209 1.6790 1.4367 3.2932 2.4604 3.3083 2.6745 1.6024 3.1161 3.2860 2.6912 2.4722 2.7105 2.5204 2.7320 2.1820 2.8200 1.5317 1.9537 1.7158 1.6514 1.5603 1.6502 2.7695 3.0594 2.7210 2.2787 2.1822 2.1221 2.6313 2.5852 2.5775 1.5539 1.7692 1.6257 1.7459 1.3677 1.6530 1.5559 1.8586 1.6408 1.3301 1.3777 1.4867 1.5257 1.1979 1.2035 1.2364 1.2260 1.2217 1.0664 1.1924 1.1548 1.0704 1.1278 1.0804 1.3659 1.0502 1.3223 1.0618 1.1156 1.9278 1.9013 1.8300 7.7143 7.1808 5.9633 6.2384 9.1073 1.0774 1.0407 1.0356 1.0357 1.0360 1.0823 1.0363 1.0846 1.0828 1.0998 1.0997 1.0981 1.1010 1.1010 1.1012 1.0988 1.1011 1.1014 1.1015 1.0807 1.0775 1.0780 1.0643 1.0781
irintensity: 0.5927 1.0081 0.2355 1.8373 0.6106 0.2989 3.1383 8.5597 0.4342 2.5531 0.7877 1.8901 16.0095 7.9703 6.0423 3.5905 13.1489 13.4738 9.6023 0.9254 2.4336 0.3018 7.0705 3.4189 2.8654 8.8473 0.9710 4.7409 7.9424 1.9404 27.2175 1.0162 4.6707 7.6522 6.6924 16.6477 28.9261 14.8433 40.0699 66.1100 21.1230 11.7645 138.0900 6.3335 12.1118 10.9125 63.1532 73.1482 37.1790 6.4374 23.0624 77.7228 97.6294 6.7939 1.4957 4.3930 16.1574 1.0652 12.7784 4.8493 64.6605 52.5505 4.8122 130.6714 13.4493 14.5619 5.4896 2.4041 5.3994 2.3716 5.4880 63.2410 35.6867 5.6889 18.5521 23.2762 30.4590 11.2675 13.0733 10.3228 28.0231 4.9413 7.8168 9.8178 36.3365 12.2533 9.3210 7.1429 4.1035 10.6056 19.4788 46.2275 51.5578 10.3851 34.2113 37.1659 158.5194 156.5429 75.9669 125.3461 39.2917 401.8152 10.5875 270.5000 27.2393 36.3078 92.5655 80.7375 247.2453 215.5087 90.4384 63.4866 249.7213 242.4672 21.8879 21.0099 18.9844 11.2394 9.8955 17.0171 18.3956 2.6786 13.0348 35.4341 29.1980 11.1401 16.5635 20.2937 20.9682 17.3145 8.7469 11.0843 10.0026 138.6704 129.6809 101.8540 32.2952 29.4277
temp: 298.150 k
press: 1.00000 atm
elementType: 8 8 8 8 8 8 7 7 7 7 6 6 6 6 6 6 6 6 6 6 6 6 6 6 1 1 1 1 1 1 1 1 1 1 1 1 1 1 1 1 1 1 1 1 1 1 1 1
symmnumber: 1
zpe: 1017229.3 jmol-1
zpe.correction: 0.387442 hartree
zpe.thermalcorrener: 0.415442 hartree
zpe.thermalcorrenthalpy: 0.416386 hartree
zpe.thermalcorrgfe: 0.323862 hartree
zpe.sumelectzpe: -1216.453453 hartree
zpe.sumelectthermal: -1216.425454 hartree
zpe.sumelectthermalent: -1216.424509 hartree
zpe.sumelectthermalfe: -1216.517034 hartree
dipole: -0.8052 -3.5948 -0.4872
dipole: 3.7159
quadrupole: -180.5361 -147.6338 -138.6205
quadrupole: -8.0945 11.7754 2.0271
quadrupole: -24.9393 7.9630 16.9763 -8.0945 11.7754 2.0271
hfenergy: -1216.8408954 hartree
pointgroup: C01 [X(C14H24N4O6)]
dipole: -0.1462389 1.2728774 -0.7040871 debye
polarizability: 239.1907648|-13.7088348|177.0890289|9.6929547|-23.6864555|184.2547978 unknown
InChI: InChI=1S/C14H24N4O6/c1-6(15-10(5)19)11(20)16-7(2)12(21)17-8(3)13(22)18-9(4)14(23)24/h6-9,15-18,23H,1-5H3
charge 0 multiplicity 1
48 atoms
O  -0.682731 0.704728 0.859263
O  -4.551493 1.336559 -1.518906
O  3.705958 0.475614 -1.277922
O  -3.591311 -1.239706 2.448566
O  -5.408791 -2.530788 1.791337
O  5.872466 -2.028993 2.316245
N  -1.288083 1.956766 -0.998958
N  1.779243 0.210731 -0.012173
N  -3.540485 0.230383 0.266988
N  5.299332 -0.668882 0.526295
C  0.891374 0.778812 -1.033012
C  -2.587134 2.394444 -0.426093
C  -0.421583 1.148429 -0.312589
C  3.93622 -0.425962 1.007955
C  -3.657681 1.276809 -0.618276
C  0.634972 -0.216575 -2.198698
C  3.133693 0.117597 -0.194105
C  -3.039891 3.707048 -1.076458
C  -4.456916 -0.915595 0.196451
C  3.909111 0.56173 2.207209
C  -4.054226 -1.934429 -0.909043
C  -4.572406 -1.641736 1.532858
C  6.183618 -1.475383 1.212781
C  7.553267 -1.656642 0.56452
H  1.371286 1.686896 -1.448425
H  -2.415984 2.528648 0.658286
H  -1.063283 2.256024 -1.95073
H  3.506347 -1.389923 1.346994
H  1.321313 -0.041457 0.873099
H  0.12923 -1.125506 -1.82932
H  1.603334 -0.497157 -2.643636
H  0.009516 0.237301 -2.988904
H  -2.258233 4.480683 -0.978335
H  -3.957916 4.072115 -0.587739
H  -3.285774 3.551018 -2.141332
H  -5.46181 -0.529889 -0.059852
H  -2.752113 0.211078 0.930288
H  4.532689 0.147769 3.016159
H  2.882912 0.699898 2.59392
H  4.309329 1.546181 1.908135
H  5.513652 -0.265985 -0.393855
H  -3.045245 -2.34044 -0.717881
H  -4.059247 -1.417727 -1.882646
H  -4.776574 -2.76737 -0.941367
H  8.331576 -1.286039 1.254056
H  7.739425 -2.733578 0.41127
H  7.652433 -1.132929 -0.40162
H  -3.682087 -1.760368 3.2916
